{"text_format":"1","workbook":"xlsx","n_sheets":35,"sheets":["START","Instructions","Template names","Lookup and lists","Org structure","Contacts","C1-Sum","C2-FinPerf SC","C2C","C3-FinPerf V","C3C","C4-FinPerf RE","C5-Capex","C5C","C6-FinPos","C7-CFlow","SC1","SC2","SC3","SC4","SC5","SC6","SC7(1)","SC7(2)","SC8","SC9","SC10","SC11","SC12","SC13a","SC13b","SC13c","SC13d","SC13e","SC71charts"],"not_rendered":{"charts":5,"images":17,"macros":1,"external_links":5,"defined_names":2031,"comments":0,"pivot_tables":0},"unopened":[],"bounds":{"document_bytes":16777216,"sheet_cells":100000,"rows_first":2000,"rows_last":500,"rows_between":2000,"halvings":0,"cell_chars":16384,"cell_head_chars":4096},"cells_cut":0,"cells_raw":0,"read":"whole","date_system":"1900"}

{"sheet":"START","index":0,"n_rows":1,"n_cols":1,"rows_kept":1,"cut":false,"hidden":false,"merged":[]}
[{"$f":"muni","v":"LIM355 Lepelle-Nkumpi"}]

{"sheet":"Instructions","index":1,"n_rows":55,"n_cols":25,"rows_kept":55,"cut":false,"hidden":false,"merged":[]}
[]
[null,null,null,2020]
[]
[null,null,null,null,null,null,null,null,null,null,null,null,null,null,null,null,null,null,null,null,null,null,null,"Yes"]
[null,null,null,null,null,null,null,null,null,null,null,null,null,null,null,null,null,null,null,null,null,null,null,"No"]
[]
[null,null,null,null,null,null,null,null,null,null,null,null,null,null,null,null,null,null,null,null,null,null,"Type of Entities Range:","Parent Municipality"]
[null,null,null,null,null,null,null,null,null,null,null,null,null,null,null,null,null,null,null,null,null,null,null,"Consolidated Information"]
[]
[null,null,null,null,null,null,null,null,null,null,null,null,null,null,null,null,null,null,null,null,null,null,"Date linked",8]
[null,null,null,null,null,null,null,null,null,null,null,null,null,null,null,null,null,null,null,null,null,null,"Date",{"$f":"VLOOKUP(X10,W39:X55,2)","v":"M08 February"},"2013-08-01"]
[]
[]
[]
[]
[]
[]
[]
[null,null,null,null,null,null,null,null,null,null,null,null,null,null,null,null,null,null,null,null,null,null,"MTREF Range:",2008]
[null,null,null,null,null,null,null,null,null,null,null,null,null,null,null,null,null,null,null,null,null,null,null,2009]
[null,null,null,null,null,null,null,null,null,null,null,null,null,null,null,null,null,null,null,null,null,null,null,2010]
[null,null,null,null,null,null,null,null,null,null,null,null,null,null,null,null,null,null,null,null,null,null,null,2011]
[null,null,null,null,null,null,null,null,null,null,null,null,null,null,null,null,null,null,null,null,null,null,null,2012]
[null,null,null,null,null,null,null,null,null,null,null,null,null,null,null,null,null,null,null,null,null,null,null,2013]
[null,null,null,null,null,null,null,null,null,null,null,null,null,null,null,null,null,null,null,null,null,null,null,2014]
[null,null,null,null,null,null,null,null,null,null,null,null,null,null,null,null,null,null,null,null,null,null,null,2015]
[null,null,null,null,null,null,null,null,null,null,null,null,null,null,null,null,null,null,null,null,null,null,null,2016]
[null,null,null,null,null,null,null,null,null,null,null,null,null,null,null,null,null,null,null,null,null,null,null,2017]
[null,null,null,null,null,null,null,null,null,null,null,null,null,null,null,null,null,null,null,null,null,null,null,2018]
[null,null,null,null,null,null,null,null,null,null,null,null,null,null,null,null,null,null,null,null,null,null,null,2019]
[null,null,null,null,null,null,null,null,null,null,null,null,null,null,null,null,null,null,null,null,null,null,null,2020]
[null,null,null,null,null,null,null,null,null,null,null,null,null,null,null,null,null,null,null,null,null,null,null,2021]
[null,null,null,null,null,null,null,null,null,null,null,null,null,null,null,null,null,null,null,null,null,null,null,2022]
[null,null,null,null,null,null,null,null,null,null,null,null,null,null,null,null,null,null,null,null,null,null,"MTREF Linked:"]
[null,null,null,null,null,null,null,null,null,null,null,null,null,null,null,null,null,null,null,null,null,null,"MTREF:",13]
[null,null,null,null,null,null,null,null,null,null,null,null,null,null,null,null,null,null,null,null,null,null,null,{"$f":"INDEX(X19:X33,X35,1)","v":2020}]
[null,null,null,null,null,null,null,null,null,null,null,null,null,null,null,null,null,null,null,null,null,null,"Fin Year:"]
[null,null,null,null,null,null,null,null,null,null,null,null,null,null,null,null,null,null,null,null,null,null,null,{"$f":"MTREF&\"/\"&RIGHT(MTREF,2)+1","v":"2020/21"}]
[null,null,null,null,null,null,null,null,null,null,null,null,null,null,null,null,null,null,null,null,null,"Date/type of report",1,"M01 July"]
[null,null,null,null,null,null,null,null,null,null,null,null,null,null,null,null,null,null,null,null,null,null,2,"M02 August"]
[null,null,null,null,null,null,null,null,null,null,null,null,null,null,null,null,null,null,null,null,null,null,3,"M03 September"]
[null,null,null,null,null,null,null,null,null,null,null,null,null,null,null,null,null,null,null,null,null,null,4,"M04 October"]
[null,null,null,null,null,null,null,null,null,null,null,null,null,null,null,null,null,null,null,null,null,null,5,"M05 November"]
[null,null,null,null,null,null,null,null,null,null,null,null,null,null,null,null,null,null,null,null,null,null,6,"M06 December"]
[null,null,null,null,null,null,null,null,null,null,null,null,null,null,null,null,null,null,null,null,null,null,7,"M07 January"]
[null,null,null,null,null,null,null,null,null,null,null,null,null,null,null,null,null,null,null,null,null,null,8,"M08 February"]
[null,null,null,null,null,null,null,null,null,null,null,null,null,null,null,null,null,null,null,null,null,null,9,"M09 March"]
[null,null,null,null,null,null,null,null,null,null,null,null,null,null,null,null,null,null,null,null,null,null,10,"M10 April"]
[null,null,null,null,null,null,null,null,null,null,null,null,null,null,null,null,null,null,null,null,null,null,11,"M11 May"]
[null,null,null,null,null,null,null,null,null,null,null,null,null,null,null,null,null,null,null,null,null,null,12,"M12 June"]
[null,null,null,null,null,null,null,null,null,null,null,null,null,null,null,null,null,null,null,null,null,null,13,"Q1 First Quarter"]
[null,null,null,null,null,null,null,null,null,null,null,null,null,null,null,null,null,null,null,null,null,null,14,"Q2 Second Quarter"]
[null,null,null,null,null,null,null,null,null,null,null,null,null,null,null,null,null,null,null,null,null,null,15,"Q3 Third Quarter"]
[null,null,null,null,null,null,null,null,null,null,null,null,null,null,null,null,null,null,null,null,null,null,16,"Q4 Fourth Quarter"]
[null,null,null,null,null,null,null,null,null,null,null,null,null,null,null,null,null,null,null,null,null,null,17,"Mid-Year Assessment"]

{"sheet":"Template names","index":2,"n_rows":107,"n_cols":6,"rows_kept":107,"cut":false,"hidden":true,"merged":[[0,0,0,3],[75,0,75,1],[71,0,71,3]]}
["Common sheet headings"]
["Head1",{"$f":"HLOOKUP(MTREF,Headings,2)","v":"2019/20"},"Prior year -1"]
["Head2",{"$f":"HLOOKUP(MTREF,Headings,5)","v":"Budget Year 2020/21"},"Year of approved budget"]
["Head2A",{"$f":"HLOOKUP(MTREF,Headings,4)","v":"2020/21"},"Approved budget year"]
["Head3",{"$f":"HLOOKUP(MTREF,Headings,3)","v":"2020/21 Medium Term Revenue & Expenditure Framework"},"MTREF header name"]
["Head5","Audited Outcome"]
["Head5A","Outcome"]
["Head5B","Pre-audit outcome"]
["Head6","Original Budget"]
["Head7","Adjusted Budget"]
["Head8","Full Year Forecast"]
["Head9",{"$f":"HLOOKUP(MTREF,Headings,5)","v":"Budget Year 2020/21"},"1st year of MTREF","Year1"]
["Head10",{"$f":"HLOOKUP(MTREF,Headings,6)","v":"Budget Year +1 2021/22"},"2nd year of MTREF","Year2"]
["Head11",{"$f":"HLOOKUP(MTREF,Headings,7)","v":"Budget Year +2 2022/23"},"3rd year of MTREF","Year3"]
["Head12","Forecast 2010/11",null,"Year4"]
["Head13","Forecast 2011/12",null,"Year5"]
["Head14","Forecast 2012/13",null,"Year6"]
["Head15","Forecast 2013/14",null,"Year7"]
["Head16","Forecast 2014/15",null,"Year8"]
["Head17","Forecast 2015/16",null,"Year9"]
["Head18","Forecast 2016/17",null,"Year10"]
["Head19","Forecast 2017/18",null,"Year11"]
["Head20","Forecast 2018/19",null,"Year12"]
["Head21","Forecast 2019/20",null,"Year13"]
["Head22","Forecast 2020/21",null,"Year14"]
["Head23","Forecast 2021/22",null,"Year15"]
["Head24","Description",null,"Desc"]
["Head25","Schedule of funding diligence",null,"fdil"]
["Head26","Vote Description",null,"VDesc"]
["Head27","Ref"]
["Head27a","References"]
["Head28","Surplus/ (Deficit) for the year",null,"Result"]
["Head29","Annual target 2007/08"]
["Head30","Revised target 2007/08"]
["Head31","Quarter ended 30 September"]
["Head32","Quarter ended 31 December"]
["Head33","Quarter ended 31 March"]
["Head34","Quarter ended 30 June"]
["Head35","Variance explanation"]
["Head36","YTD  Actual 31 Dec"]
["Head37","YTD  Budget 31 Dec"]
["Head38","Monthly actual"]
["Head39","YearTD actual"]
["Head40","YearTD budget"]
["Head41","YTD variance"]
["Head42","Surplus/ (Deficit) for the yr/period"]
["Head43",{"$f":"Head3&\" Summary\"","v":"2020/21 Medium Term Revenue & Expenditure Framework Summary"}]
["Head44","1996 Census"]
["Head45","2001 Census"]
["Head46"," - Adjustments Budget - Month YYYY"]
["Head47","Previous target year to complete"]
["Head48","Present value"]
["Head49","Virement"]
["Head50","Other Adjusts."]
["Head51","Accum. Funds"]
["Head52","Multi-year capital"]
["Head53","Unfore. Unavoid."]
["Head54","Prior Adjusted"]
["Head55","Nat. or Prov. Govt"]
["Head56","Total Adjusts."]
["Head57",{"$f":"date","v":"M08 February"}]
["Head58","Parent muni."]
["Head59","Downward adjusts"]
["Head60","Month","Report header part name",{"$f":"MONTH(date)","v":{"$error":"#VALUE!"}}]
["SFPerf1","Budgeted Financial Performance"]
["SFPerf2","Forecast Financial Performance"]
["SFPos1","Budgeted Financial Position"]
["SFPos2","Forecast Financial Position"]
["Cash1","Budget Cash Flow"]
["Cash2","Forecast Cash Flow"]
["RandM","Expenditure includes repairs & maintenance of R'000"]
["Standard nomenclature"]
["Muni",{"$f":"'Lookup and lists'!B27","v":"LIM355 Lepelle-Nkumpi"}]
["Municipal Entities",2,"Type of report:",1]
[{"$f":"IF((MuniEntities=1)*(MuniType=2),\"YES\",\"NO\")","v":"NO"},"Does this municipality have entities (consolidated budget and entity budgets required)? YES/NO"]
["s71 (Monthly Mayor report) schedules and charts"]
["S71sum",{"$f":"IF(Consolques=\"YES\",E77,F77)","v":"Table C1 Monthly Budget Statement Summary"},null,"Table C1 ",{"$f":"D77&\"Consolidated Monthly Budget Statement Summary\"","v":"Table C1 Consolidated Monthly Budget Statement Summary"},{"$f":"D77&\"Monthly Budget Statement Summary\"","v":"Table C1 Monthly Budget Statement Summary"}]
["S71C","Table C3 Monthly Budget Statement - Financial Performance (revenue and expenditure by municipal vote)",null,"Table C3 ",{"$f":"D78&\"Consolidated Monthly Budget Statement - Financial Performance (revenue and expenditure by municipal vote) \"","v":"Table C3 Consolidated Monthly Budget Statement - Financial Performance (revenue and expenditure by municipal vote) "},{"$f":"D78&\"Monthly Budget Statement - Financial Performance (revenue and expenditure by municipal vote)\"","v":"Table C3 Monthly Budget Statement - Financial Performance (revenue and expenditure by municipal vote)"}]
["S71A",{"$f":"IF(Consolques=\"YES\",E79,F79)","v":"Table C2 Monthly Budget Statement - Financial Performance (functional classification)"},null,"Table C2 ",{"$f":"D79&\"Consolidated Monthly Budget Statement - Financial Performance (functional classification) \"","v":"Table C2 Consolidated Monthly Budget Statement - Financial Performance (functional classification) "},{"$f":"D79&\"Monthly Budget Statement - Financial Performance (functional classification)\"","v":"Table C2 Monthly Budget Statement - Financial Performance (functional classification)"}]
["S71B",{"$f":"IF(Consolques=\"YES\",E80,F80)","v":"Table C4 Monthly Budget Statement - Financial Performance (revenue and expenditure)"},null,"Table C4 ",{"$f":"D80&\"Consolidated Monthly Budget Statement - Financial Performance (revenue and expenditure) \"","v":"Table C4 Consolidated Monthly Budget Statement - Financial Performance (revenue and expenditure) "},{"$f":"D80&\"Monthly Budget Statement - Financial Performance (revenue and expenditure)\"","v":"Table C4 Monthly Budget Statement - Financial Performance (revenue and expenditure)"}]
["S71D",{"$f":"IF(Consolques=\"YES\",E81,F81)","v":"Table C5 Monthly Budget Statement - Capital Expenditure (municipal vote, functional classification and funding)"},null,"Table C5 ",{"$f":"D81&\"Consolidated Monthly Budget Statement - Capital Expenditure (municipal vote, functional classification and funding \"","v":"Table C5 Consolidated Monthly Budget Statement - Capital Expenditure (municipal vote, functional classification and funding "},{"$f":"D81&\"Monthly Budget Statement - Capital Expenditure (municipal vote, functional classification and funding)\"","v":"Table C5 Monthly Budget Statement - Capital Expenditure (municipal vote, functional classification and funding)"}]
["S71E","Table C6 Monthly Budget Statement - Financial Position",null,"Table C6 ",{"$f":"D82&\"Consolidated Monthly Budget Statement - Financial Position \"","v":"Table C6 Consolidated Monthly Budget Statement - Financial Position "},{"$f":"D82&\"Monthly Budget Statement - Financial Position\"","v":"Table C6 Monthly Budget Statement - Financial Position"}]
["S71F","Table C7 Monthly Budget Statement - Cash Flow ",null,"Table C7 ",{"$f":"D83&\"Consolidated Monthly Budget Statement - Cash Flow \"","v":"Table C7 Consolidated Monthly Budget Statement - Cash Flow "},{"$f":"D83&\"Monthly Budget Statement - Cash Flow \"","v":"Table C7 Monthly Budget Statement - Cash Flow "}]
["S71G",{"$f":"D84&\"Material variance explanations \"","v":"Supporting Table SC1 Material variance explanations "},null,"Supporting Table SC1 "]
["S71H",{"$f":"D85&\"Monthly Budget Statement - performance indicators  \"","v":"Supporting Table SC2 Monthly Budget Statement - performance indicators  "},null,"Supporting Table SC2 "]
["S71I",{"$f":"D86&\"Monthly Budget Statement - aged debtors\"","v":"Supporting Table SC3 Monthly Budget Statement - aged debtors"},null,"Supporting Table SC3 "]
["S71J",{"$f":"D87&\"Monthly Budget Statement - aged creditors \"","v":"Supporting Table SC4 Monthly Budget Statement - aged creditors "},null,"Supporting Table SC4 "]
["S71K",{"$f":"D88&\"Monthly Budget Statement - investment portfolio \"","v":"Supporting Table SC5 Monthly Budget Statement - investment portfolio "},null,"Supporting Table SC5 "]
["S71L",{"$f":"D89&\"Monthly Budget Statement - transfers and grant receipts \"","v":"Supporting Table SC6 Monthly Budget Statement - transfers and grant receipts "},null,"Supporting Table SC6 "]
["S71M",{"$f":"D90&\" Monthly Budget Statement - transfers and grant expenditure \"","v":"Supporting Table SC7(1) Monthly Budget Statement - transfers and grant expenditure "},null,"Supporting Table SC7(1)"]
["S71N",{"$f":"D91&\"Monthly Budget Statement - councillor and staff benefits \"","v":"Supporting Table SC8 Monthly Budget Statement - councillor and staff benefits "},null,"Supporting Table SC8 "]
["S71O",{"$f":"D92&\"Monthly Budget Statement - actuals and revised targets for cash receipts\"","v":"Supporting Table SC9 Monthly Budget Statement - actuals and revised targets for cash receipts"},null,"Supporting Table SC9 "]
["S71P",{"$f":"IF(Consolques=\"YES\",E93,F93)","v":"NOT REQUIRED - municipality does not have entities or this is the parent municipality's budget"},null,"Supporting Table SC10 ",{"$f":"D93&\"Monthly Budget Statement  - Parent Municipality Financial Performance (revenue and expenditure) \"","v":"Supporting Table SC10 Monthly Budget Statement  - Parent Municipality Financial Performance (revenue and expenditure) "},"NOT REQUIRED - municipality does not have entities or this is the parent municipality's budget"]
["S71Q","NOT REQUIRED - municipality does not have entities or this is the parent municipality's budget",null,"Supporting Table SC11 ",{"$f":"D94&\"Monthly Budget Statement - summary of municipal entities\"","v":"Supporting Table SC11 Monthly Budget Statement - summary of municipal entities"},"NOT REQUIRED - municipality does not have entities or this is the parent municipality's budget"]
["S71R","Supporting Table SC12 Monthly Budget Statement - capital expenditure trend",null,"Supporting Table SC12 ",{"$f":"D95&\"Consolidated Monthly Budget Statement - capital expenditure trend \"","v":"Supporting Table SC12 Consolidated Monthly Budget Statement - capital expenditure trend "},{"$f":"D95&\"Monthly Budget Statement - capital expenditure trend\"","v":"Supporting Table SC12 Monthly Budget Statement - capital expenditure trend"}]
["S71Sa","Supporting Table SC13a Monthly Budget Statement - capital expenditure on new assets by asset class",null,"Supporting Table SC13a ",{"$f":"D96&\"Consolidated Monthly Budget Statement - capital expenditure on new assets by asset class\"","v":"Supporting Table SC13a Consolidated Monthly Budget Statement - capital expenditure on new assets by asset class"},{"$f":"D96&\"Monthly Budget Statement - capital expenditure on new assets by asset class\"","v":"Supporting Table SC13a Monthly Budget Statement - capital expenditure on new assets by asset class"}]
["S71Sb","Supporting Table SC13b Monthly Budget Statement - capital expenditure on renewal of existing assets by asset class",null,"Supporting Table SC13b ",{"$f":"D97&\"Consolidated Monthly Budget Statement - capital expenditure on renewal of existing assets by asset class\"","v":"Supporting Table SC13b Consolidated Monthly Budget Statement - capital expenditure on renewal of existing assets by asset class"},{"$f":"D97&\"Monthly Budget Statement - capital expenditure on renewal of existing assets by asset class\"","v":"Supporting Table SC13b Monthly Budget Statement - capital expenditure on renewal of existing assets by asset class"}]
["S71Sc","Supporting Table SC13c Monthly Budget Statement - expenditure on repairs and maintenance by asset class",null,"Supporting Table SC13c ",{"$f":"D98&\"Consolidated Monthly Budget Statement - expenditure on repairs and maintenance by asset class\"","v":"Supporting Table SC13c Consolidated Monthly Budget Statement - expenditure on repairs and maintenance by asset class"},{"$f":"D98&\"Monthly Budget Statement - expenditure on repairs and maintenance by asset class\"","v":"Supporting Table SC13c Monthly Budget Statement - expenditure on repairs and maintenance by asset class"}]
["S71Sd","Supporting Table SC13d Monthly Budget Statement - depreciation by asset class",null,"Supporting Table SC13d ",{"$f":"D99&\"Consolidated Monthly Budget Statement - depreciation by asset class\"","v":"Supporting Table SC13d Consolidated Monthly Budget Statement - depreciation by asset class"},{"$f":"D99&\"Monthly Budget Statement - depreciation by asset class\"","v":"Supporting Table SC13d Monthly Budget Statement - depreciation by asset class"}]
["S71Se",{"$f":"IF(Consolques=\"YES\",E100,F100)","v":"Supporting Table SC13e Monthly Budget Statement - capital expenditure on upgrading of existing assets by asset class"},null,"Supporting Table SC13e ",{"$f":"D100&\"Consolidated Monthly Budget Statement - capital expenditure on upgrading of existing assets by asset class\"","v":"Supporting Table SC13e Consolidated Monthly Budget Statement - capital expenditure on upgrading of existing assets by asset class"},{"$f":"D100&\"Monthly Budget Statement - capital expenditure on upgrading of existing assets by asset class\"","v":"Supporting Table SC13e Monthly Budget Statement - capital expenditure on upgrading of existing assets by asset class"}]
[null,"s71 charts listing"]
[null,{"$f":"D102&Head2A&\" Capital Expenditure Monthly Trend: actual v target\"","v":"Chart C1 2020/21 Capital Expenditure Monthly Trend: actual v target"},null,"Chart C1 "]
[null,{"$f":"D103&Head2A&\" Capital Expenditure: YTD actual v YTD target\"","v":"Chart C2 2020/21 Capital Expenditure: YTD actual v YTD target"},null,"Chart C2 "]
[null,{"$f":"D104&\"Aged Consumer Debtors Analysis\"","v":"Chart C3 Aged Consumer Debtors Analysis"},null,"Chart C3 "]
[null,{"$f":"D105&\"Consumer Debtors (total by Debtor Customer Category)\"","v":"Chart C4 Consumer Debtors (total by Debtor Customer Category)"},null,"Chart C4 "]
[null,{"$f":"D106&\"Aged Creditors Analysis\"","v":"Chart C5 Aged Creditors Analysis"},null,"Chart C5 "]
["S71T",{"$f":"D107&\" Monthly Budget Statement - Expenditure against approved rollovers\"","v":"Supporting Table SC7(2) Monthly Budget Statement - Expenditure against approved rollovers"},null,"Supporting Table SC7(2)"]

{"sheet":"Lookup and lists","index":3,"n_rows":307,"n_cols":22,"rows_kept":307,"cut":false,"hidden":true,"merged":[]}
["Description",2007,2008,2009,2010,2011,2012,2013,2014,2015,2016,2017,2018,2019,2020,null,"Grants:","National - opex","Provincial - opex","National - capex","Provincial - capex","YESNO"]
[{"$f":"'Template names'!C2","v":"Prior year -1"},"2006/07","2007/08","2008/09",{"$f":"E1-1&\"/\"&RIGHT(E1,2)-0","v":"2009/10"},{"$f":"F1-1&\"/\"&RIGHT(F1,2)-0","v":"2010/11"},"2011/12","2012/13","2013/14","2014/15","2015/16","2016/17","2017/18","2018/19","2019/20",null,null,"Local Government Equitable Share","Health subsidy","Municipal Infrastructure Grant (MIG)","Agriculture","Yes"]
[{"$f":"'Template names'!C5","v":"MTREF header name"},"2007/08 Medium Term Revenue & Expenditure Framework","2008/09 Medium Term Revenue & Expenditure Framework","2009/10 Medium Term Revenue & Expenditure Framework",{"$f":"E1&\"/\"&RIGHT(E1,2)+1&\" Medium Term Revenue & Expenditure Framework\"","v":"2010/11 Medium Term Revenue & Expenditure Framework"},{"$f":"F1&\"/\"&RIGHT(F1,2)+1&\" Medium Term Revenue & Expenditure Framework\"","v":"2011/12 Medium Term Revenue & Expenditure Framework"},"2012/13 Medium Term Revenue & Expenditure Framework","2013/14 Medium Term Revenue & Expenditure Framework","2014/15 Medium Term Revenue & Expenditure Framework","2015/16 Medium Term Revenue & Expenditure Framework","2016/17 Medium Term Revenue & Expenditure Framework","2017/18 Medium Term Revenue & Expenditure Framework","2018/19 Medium Term Revenue & Expenditure Framework","2019/20 Medium Term Revenue & Expenditure Framework","2020/21 Medium Term Revenue & Expenditure Framework",null,null,"RSC Levy Replacement ","Ambulance subsidy","Public Transport and Systems","Education","No"]
[{"$f":"'Template names'!C4","v":"Approved budget year"},"2007/08","2008/09","2009/10",{"$f":"E1&\"/\"&RIGHT(E1,2)+1","v":"2010/11"},{"$f":"F1&\"/\"&RIGHT(F1,2)+1","v":"2011/12"},"2012/13","2013/14","2014/15","2015/16","2016/17","2017/18","2018/19","2019/20","2020/21",null,null,"Finance Management ","Housing","Rural Transport Services and Infrastructure","Health"]
[{"$f":"'Template names'!C12","v":"1st year of MTREF"},"Budget Year 2007/08","Budget Year 2008/09","Budget Year 2009/10",{"$f":"\"Budget Year \"&E1&\"/\"&RIGHT(E1,2)+1","v":"Budget Year 2010/11"},{"$f":"\"Budget Year \"&F1&\"/\"&RIGHT(F1,2)+1","v":"Budget Year 2011/12"},"Budget Year 2012/13","Budget Year 2013/14","Budget Year 2014/15","Budget Year 2015/16","Budget Year 2016/17","Budget Year 2017/18","Budget Year 2018/19","Budget Year 2019/20","Budget Year 2020/21",null,null,"Municipal Systems Improvement","Sport and Recreation","Regional Bulk Infrastructure","Housing and Local Government "]
[{"$f":"'Template names'!C13","v":"2nd year of MTREF"},"Budget Year +1 2008/09","Budget Year +1 2009/10","Budget Year +1 2010/11",{"$f":"\"Budget Year +1 \"&E1+1&\"/\"&RIGHT(E1,2)+2","v":"Budget Year +1 2011/12"},{"$f":"\"Budget Year +1 \"&F1+1&\"/\"&RIGHT(F1,2)+2","v":"Budget Year +1 2012/13"},"Budget Year +1 2013/14","Budget Year +1 2014/15","Budget Year +1 2015/16","Budget Year +1 2016/17","Budget Year +1 2017/18","Budget Year +1 2018/19","Budget Year +1 2019/20","Budget Year +1 2020/21","Budget Year +1 2021/22",null,null,"Water Services Operating Subsidy ",null,"Rural Households Infrastructure ","Other Departments"]
[{"$f":"'Template names'!C14","v":"3rd year of MTREF"},"Budget Year +2 2009/10","Budget Year +2 2010/11","Budget Year +2 2011/12",{"$f":"\"Budget Year +2 \"&E1+2&\"/\"&RIGHT(E1,2)+3","v":"Budget Year +2 2012/13"},{"$f":"\"Budget Year +2 \"&F1+2&\"/\"&RIGHT(F1,2)+3","v":"Budget Year +2 2013/14"},"Budget Year +2 2014/15","Budget Year +2 2015/16","Budget Year +2 2016/17","Budget Year +2 2017/18","Budget Year +2 2018/19","Budget Year +2 2019/20","Budget Year +2 2020/21","Budget Year +2 2021/22","Budget Year +2 2022/23",null,null,"Energy Efficiency  and Demand Management",null,"Neighbourhood Development Partnership","Public Works, Roads, Transport "]
["NOTE: This sheet should not be directly amended - select headings from sheet 'S'",null,null,null,null,null,null,null,null,null,null,null,null,null,null,null,null,"Integrated National Electrification Programme",null,"2010 FIFA World Cup Stadiums Development","Sport and Recreation"]
[null,null,null,null,null,null,null,null,null,null,null,null,null,null,null,null,null,"Municipal Drought Relief "]
[null,null,null,null,null,null,null,null,null,null,null,null,null,null,null,null,null,"2010 FIFA World Cup Operating"]
[null,null,null,null,null,null,null,null,null,null,null,null,null,null,null,null,null,"Electricity Demand Side Management"]
[null,null,null,null,null,null,null,null,null,null,null,null,null,null,null,null,null,"EPWP Incentive"]
[]
[]
[]
[]
[]
[]
[]
[]
[]
[]
[]
[]
[]
["Name link",143]
["Name of Muni",{"$f":"INDEX(B28:B311,B26,1)","v":"LIM355 Lepelle-Nkumpi"}]
[null,"Choose name from list","Set name on 'Instructions' sheet"]
[null,"BUF Buffalo City","EC EASTERN CAPE"]
[null,"NMA Nelson Mandela Bay","EC EASTERN CAPE"]
[null,"EC101 Dr Beyers Naude","EC EASTERN CAPE"]
[null,"EC102 Blue Crane Route","EC EASTERN CAPE"]
[null,"EC104 Makana","EC EASTERN CAPE"]
[null,"EC105 Ndlambe","EC EASTERN CAPE"]
[null,"EC106 Sundays River Valley","EC EASTERN CAPE"]
[null,"EC108 Kouga","EC EASTERN CAPE"]
[null,"EC109 Kou-Kamma","EC EASTERN CAPE"]
[null,"DC10 Sarah Baartman","EC EASTERN CAPE"]
[null,"EC121 Mbhashe","EC EASTERN CAPE"]
[null,"EC122 Mnquma","EC EASTERN CAPE"]
[null,"EC123 Great Kei","EC EASTERN CAPE"]
[null,"EC124 Amahlathi","EC EASTERN CAPE"]
[null,"EC126 Ngqushwa","EC EASTERN CAPE"]
[null,"EC129 Raymond Mhlaba","EC EASTERN CAPE"]
[null,"DC12 Amathole","EC EASTERN CAPE"]
[null,"EC131 Inxuba Yethemba","EC EASTERN CAPE"]
[null,"EC135 Intsika Yethu","EC EASTERN CAPE"]
[null,"EC136 Emalahleni (Ec)","EC EASTERN CAPE"]
[null,"EC137 Engcobo","EC EASTERN CAPE"]
[null,"EC138 Sakhisizwe","EC EASTERN CAPE"]
[null,"EC139 Enoch Mgijima","EC EASTERN CAPE"]
[null,"DC13 Chris Hani","EC EASTERN CAPE"]
[null,"EC141 Elundini","EC EASTERN CAPE"]
[null,"EC142 Senqu","EC EASTERN CAPE"]
[null,"EC145 Walter Sisulu","EC EASTERN CAPE"]
[null,"DC14 Joe Gqabi","EC EASTERN CAPE"]
[null,"EC153 Ngquza Hills","EC EASTERN CAPE"]
[null,"EC154 Port St Johns","EC EASTERN CAPE"]
[null,"EC155 Nyandeni","EC EASTERN CAPE"]
[null,"EC156 Mhlontlo","EC EASTERN CAPE"]
[null,"EC157 King Sabata Dalindyebo","EC EASTERN CAPE"]
[null,"DC15 O .R. Tambo","EC EASTERN CAPE"]
[null,"EC441 Matatiele","EC EASTERN CAPE"]
[null,"EC442 Umzimvubu","EC EASTERN CAPE"]
[null,"EC443 Mbizana","EC EASTERN CAPE"]
[null,"EC444 Ntabankulu","EC EASTERN CAPE"]
[null,"DC44 Alfred Nzo","EC EASTERN CAPE"]
[null,"MAN Mangaung","FS FREE STATE"]
[null,"FS161 Letsemeng","FS FREE STATE"]
[null,"FS162 Kopanong","FS FREE STATE"]
[null,"FS163 Mohokare","FS FREE STATE"]
[null,"DC16 Xhariep","FS FREE STATE"]
[null,"FS181 Masilonyana","FS FREE STATE"]
[null,"FS182 Tokologo","FS FREE STATE"]
[null,"FS183 Tswelopele","FS FREE STATE"]
[null,"FS184 Matjhabeng","FS FREE STATE"]
[null,"FS185 Nala","FS FREE STATE"]
[null,"DC18 Lejweleputswa","FS FREE STATE"]
[null,"FS191 Setsoto","FS FREE STATE"]
[null,"FS192 Dihlabeng","FS FREE STATE"]
[null,"FS193 Nketoana","FS FREE STATE"]
[null,"FS194 Maluti-a-Phofung","FS FREE STATE"]
[null,"FS195 Phumelela","FS FREE STATE"]
[null,"FS196 Mantsopa","FS FREE STATE"]
[null,"DC19 Thabo Mofutsanyana","FS FREE STATE"]
[null,"FS201 Moqhaka","FS FREE STATE"]
[null,"FS203 Ngwathe","FS FREE STATE"]
[null,"FS204 Metsimaholo","FS FREE STATE"]
[null,"FS205 Mafube","FS FREE STATE"]
[null,"DC20 Fezile Dabi","FS FREE STATE"]
[null,"EKU City of Ekurhuleni","GT GAUTENG"]
[null,"JHB City Of Johannesburg","GT GAUTENG"]
[null,"TSH City Of Tshwane","GT GAUTENG"]
[null,"GT421 Emfuleni","GT GAUTENG"]
[null,"GT422 Midvaal","GT GAUTENG"]
[null,"GT423 Lesedi","GT GAUTENG"]
[null,"DC42 Sedibeng","GT GAUTENG"]
[null,"GT481 Mogale City","GT GAUTENG"]
[null,"GT484 Merafong City","GT GAUTENG"]
[null,"GT485 Rand West City","GT GAUTENG"]
[null,"DC48 West Rand","GT GAUTENG"]
[null,"ETH eThekwini","KZN KWAZULU-NATAL"]
[null,"KZN212 Umdoni","KZN KWAZULU-NATAL"]
[null,"KZN213 Umzumbe","KZN KWAZULU-NATAL"]
[null,"KZN214 uMuziwabantu","KZN KWAZULU-NATAL"]
[null,"KZN216 Ray Nkonyeni","KZN KWAZULU-NATAL"]
[null,"DC21 Ugu","KZN KWAZULU-NATAL"]
[null,"KZN221 uMshwathi","KZN KWAZULU-NATAL"]
[null,"KZN222 uMngeni","KZN KWAZULU-NATAL"]
[null,"KZN223 Mpofana","KZN KWAZULU-NATAL"]
[null,"KZN224 Impendle","KZN KWAZULU-NATAL"]
[null,"KZN225 Msunduzi","KZN KWAZULU-NATAL"]
[null,"KZN226 Mkhambathini","KZN KWAZULU-NATAL"]
[null,"KZN227 Richmond","KZN KWAZULU-NATAL"]
[null,"DC22 uMgungundlovu","KZN KWAZULU-NATAL"]
[null,"KZN235 Okhahlamba","KZN KWAZULU-NATAL"]
[null,"KZN237 Inkosi Langalibalele","KZN KWAZULU-NATAL"]
[null,"KZN238 Alfred Duma","KZN KWAZULU-NATAL"]
[null,"DC23 Uthukela","KZN KWAZULU-NATAL"]
[null,"KZN241 Endumeni","KZN KWAZULU-NATAL"]
[null,"KZN242 Nquthu","KZN KWAZULU-NATAL"]
[null,"KZN244 Msinga","KZN KWAZULU-NATAL"]
[null,"KZN245 Umvoti","KZN KWAZULU-NATAL"]
[null,"DC24 Umzinyathi","KZN KWAZULU-NATAL"]
[null,"KZN252 Newcastle","KZN KWAZULU-NATAL"]
[null,"KZN253 Emadlangeni","KZN KWAZULU-NATAL"]
[null,"KZN254 Dannhauser","KZN KWAZULU-NATAL"]
[null,"DC25 Amajuba","KZN KWAZULU-NATAL"]
[null,"KZN261 eDumbe","KZN KWAZULU-NATAL"]
[null,"KZN262 uPhongolo","KZN KWAZULU-NATAL"]
[null,"KZN263 Abaqulusi","KZN KWAZULU-NATAL"]
[null,"KZN265 Nongoma","KZN KWAZULU-NATAL"]
[null,"KZN266 Ulundi","KZN KWAZULU-NATAL"]
[null,"DC26 Zululand","KZN KWAZULU-NATAL"]
[null,"KZN271 Umhlabuyalingana","KZN KWAZULU-NATAL"]
[null,"KZN272 Jozini","KZN KWAZULU-NATAL"]
[null,"KZN275 Mtubatuba","KZN KWAZULU-NATAL"]
[null,"KZN276 Hlabisa Big Five","KZN KWAZULU-NATAL"]
[null,"DC27 Umkhanyakude","KZN KWAZULU-NATAL"]
[null,"KZN281 Mfolozi","KZN KWAZULU-NATAL"]
[null,"KZN282 uMhlathuze","KZN KWAZULU-NATAL"]
[null,"KZN284 uMlalazi","KZN KWAZULU-NATAL"]
[null,"KZN285 Mthonjaneni","KZN KWAZULU-NATAL"]
[null,"KZN286 Nkandla","KZN KWAZULU-NATAL"]
[null,"DC28 King Cetshwayo","KZN KWAZULU-NATAL"]
[null,"KZN291 Mandeni","KZN KWAZULU-NATAL"]
[null,"KZN292 KwaDukuza","KZN KWAZULU-NATAL"]
[null,"KZN293 Ndwedwe","KZN KWAZULU-NATAL"]
[null,"KZN294 Maphumulo","KZN KWAZULU-NATAL"]
[null,"DC29 iLembe","KZN KWAZULU-NATAL"]
[null,"KZN433 Greater Kokstad","KZN KWAZULU-NATAL"]
[null,"KZN434 Ubuhlebezwe","KZN KWAZULU-NATAL"]
[null,"KZN435 Umzimkhulu","KZN KWAZULU-NATAL"]
[null,"KZN436 Dr Nkosazana Dlamini Zuma","KZN KWAZULU-NATAL"]
[null,"DC43 Harry Gwala","KZN KWAZULU-NATAL"]
[null,"LIM331 Greater Giyani","LIM LIMPOPO"]
[null,"LIM332 Greater Letaba","LIM LIMPOPO"]
[null,"LIM333 Greater Tzaneen","LIM LIMPOPO"]
[null,"LIM334 Ba-Phalaborwa","LIM LIMPOPO"]
[null,"LIM335 Maruleng","LIM LIMPOPO"]
[null,"DC33 Mopani","LIM LIMPOPO"]
[null,"LIM341 Musina","LIM LIMPOPO"]
[null,"LIM343 Thulamela","LIM LIMPOPO"]
[null,"LIM344 Makhado","LIM LIMPOPO"]
[null,"LIM345 Collins Chabane","LIM LIMPOPO"]
[null,"DC34 Vhembe","LIM LIMPOPO"]
[null,"LIM351 Blouberg","LIM LIMPOPO"]
[null,"LIM353 Molemole","LIM LIMPOPO"]
[null,"LIM354 Polokwane","LIM LIMPOPO"]
[null,"LIM355 Lepelle-Nkumpi","LIM LIMPOPO"]
[null,"DC35 Capricorn","LIM LIMPOPO"]
[null,"LIM361 Thabazimbi","LIM LIMPOPO"]
[null,"LIM362 Lephalale","LIM LIMPOPO"]
[null,"LIM366 Bela Bela","LIM LIMPOPO"]
[null,"LIM367 Mogalakwena","LIM LIMPOPO"]
[null,"LIM368 Modimolle-Mookgopong","LIM LIMPOPO"]
[null,"DC36 Waterberg","LIM LIMPOPO"]
[null,"LIM471 Ephraim Mogale","LIM LIMPOPO"]
[null,"LIM472 Elias Motsoaledi","LIM LIMPOPO"]
[null,"LIM473 Makhuduthamaga","LIM LIMPOPO"]
[null,"LIM476 Tubatse Fetakgomo","LIM LIMPOPO"]
[null,"DC47 Sekhukhune","LIM LIMPOPO"]
[null,"MP301 Albert Luthuli","MP MPUMALANGA"]
[null,"MP302 Msukaligwa","MP MPUMALANGA"]
[null,"MP303 Mkhondo","MP MPUMALANGA"]
[null,"MP304 Pixley Ka Seme (MP)","MP MPUMALANGA"]
[null,"MP305 Lekwa","MP MPUMALANGA"]
[null,"MP306 Dipaleseng","MP MPUMALANGA"]
[null,"MP307 Govan Mbeki","MP MPUMALANGA"]
[null,"DC30 Gert Sibande","MP MPUMALANGA"]
[null,"MP311 Victor Khanye","MP MPUMALANGA"]
[null,"MP312 Emalahleni (Mp)","MP MPUMALANGA"]
[null,"MP313 Steve Tshwete","MP MPUMALANGA"]
[null,"MP314 Emakhazeni","MP MPUMALANGA"]
[null,"MP315 Thembisile Hani","MP MPUMALANGA"]
[null,"MP316 Dr J.S. Moroka","MP MPUMALANGA"]
[null,"DC31 Nkangala","MP MPUMALANGA"]
[null,"MP321 Thaba Chweu","MP MPUMALANGA"]
[null,"MP324 Nkomazi","MP MPUMALANGA"]
[null,"MP325 Bushbuckridge","MP MPUMALANGA"]
[null,"MP326 City of Mbombela","MP MPUMALANGA"]
[null,"DC32 Ehlanzeni","MP MPUMALANGA"]
[null,"NC451 Joe Morolong","NC NORTHERN CAPE"]
[null,"NC452 Ga-Segonyana","NC NORTHERN CAPE"]
[null,"NC453 Gamagara","NC NORTHERN CAPE"]
[null,"DC45 John Taolo Gaetsewe","NC NORTHERN CAPE"]
[null,"NC061 Richtersveld","NC NORTHERN CAPE"]
[null,"NC062 Nama Khoi","NC NORTHERN CAPE"]
[null,"NC064 Kamiesberg","NC NORTHERN CAPE"]
[null,"NC065 Hantam","NC NORTHERN CAPE"]
[null,"NC066 Karoo Hoogland","NC NORTHERN CAPE"]
[null,"NC067 Khai-Ma","NC NORTHERN CAPE"]
[null,"DC6 Namakwa","NC NORTHERN CAPE"]
[null,"NC071 Ubuntu","NC NORTHERN CAPE"]
[null,"NC072 Umsobomvu","NC NORTHERN CAPE"]
[null,"NC073 Emthanjeni","NC NORTHERN CAPE"]
[null,"NC074 Kareeberg","NC NORTHERN CAPE"]
[null,"NC075 Renosterberg","NC NORTHERN CAPE"]
[null,"NC076 Thembelihle","NC NORTHERN CAPE"]
[null,"NC077 Siyathemba","NC NORTHERN CAPE"]
[null,"NC078 Siyancuma","NC NORTHERN CAPE"]
[null,"DC7 Pixley Ka Seme (Nc)","NC NORTHERN CAPE"]
[null,"NC082 !Kai! Garib","NC NORTHERN CAPE"]
[null,"NC084 !Kheis","NC NORTHERN CAPE"]
[null,"NC085 Tsantsabane","NC NORTHERN CAPE"]
[null,"NC086 Kgatelopele","NC NORTHERN CAPE"]
[null,"NC087 Dawid Kruiper","NC NORTHERN CAPE"]
[null,"DC8 Z F Mgcawu","NC NORTHERN CAPE"]
[null,"NC091 Sol Plaatje","NC NORTHERN CAPE"]
[null,"NC092 Dikgatlong","NC NORTHERN CAPE"]
[null,"NC093 Magareng","NC NORTHERN CAPE"]
[null,"NC094 Phokwane","NC NORTHERN CAPE"]
[null,"DC9 Frances Baard","NC NORTHERN CAPE"]
[null,"NW371 Moretele","NW NORTH WEST"]
[null,"NW372 Madibeng","NW NORTH WEST"]
[null,"NW373 Rustenburg","NW NORTH WEST"]
[null,"NW374 Kgetlengrivier","NW NORTH WEST"]
[null,"NW375 Moses Kotane","NW NORTH WEST"]
[null,"DC37 Bojanala Platinum","NW NORTH WEST"]
[null,"NW381 Ratlou","NW NORTH WEST"]
[null,"NW382 Tswaing","NW NORTH WEST"]
[null,"NW383 Mafikeng","NW NORTH WEST"]
[null,"NW384 Ditsobotla","NW NORTH WEST"]
[null,"NW385 Ramotshere Moiloa","NW NORTH WEST"]
[null,"DC38 Ngaka Modiri Molema","NW NORTH WEST"]
[null,"NW392 Naledi (Nw)","NW NORTH WEST"]
[null,"NW393 Mamusa","NW NORTH WEST"]
[null,"NW394 Greater Taung","NW NORTH WEST"]
[null,"NW396 Lekwa-Teemane","NW NORTH WEST"]
[null,"NW397 Kagisano-Molopo","NW NORTH WEST"]
[null,"DC39 Dr Ruth Segomotsi Mompati","NW NORTH WEST"]
[null,"NW403 City Of Matlosana","NW NORTH WEST"]
[null,"NW404 Maquassi Hills","NW NORTH WEST"]
[null,"NW405 J B Marks","NW NORTH WEST"]
[null,"DC40 Dr Kenneth Kaunda","NW NORTH WEST"]
[null,"CPT Cape Town","WC WESTERN CAPE"]
[null,"WC011 Matzikama","WC WESTERN CAPE"]
[null,"WC012 Cederberg","WC WESTERN CAPE"]
[null,"WC013 Bergrivier","WC WESTERN CAPE"]
[null,"WC014 Saldanha Bay","WC WESTERN CAPE"]
[null,"WC015 Swartland","WC WESTERN CAPE"]
[null,"DC1 West Coast","WC WESTERN CAPE"]
[null,"WC022 Witzenberg","WC WESTERN CAPE"]
[null,"WC023 Drakenstein","WC WESTERN CAPE"]
[null,"WC024 Stellenbosch","WC WESTERN CAPE"]
[null,"WC025 Breede Valley","WC WESTERN CAPE"]
[null,"WC026 Langeberg","WC WESTERN CAPE"]
[null,"DC2 Cape Winelands DM","WC WESTERN CAPE"]
[null,"WC031 Theewaterskloof","WC WESTERN CAPE"]
[null,"WC032 Overstrand","WC WESTERN CAPE"]
[null,"WC033 Cape Agulhas","WC WESTERN CAPE"]
[null,"WC034 Swellendam","WC WESTERN CAPE"]
[null,"DC3 Overberg","WC WESTERN CAPE"]
[null,"WC041 Kannaland","WC WESTERN CAPE"]
[null,"WC042 Hessequa","WC WESTERN CAPE"]
[null,"WC043 Mossel Bay","WC WESTERN CAPE"]
[null,"WC044 George","WC WESTERN CAPE"]
[null,"WC045 Oudtshoorn","WC WESTERN CAPE"]
[null,"WC047 Bitou","WC WESTERN CAPE"]
[null,"WC048 Knysna","WC WESTERN CAPE"]
[null,"DC4 Garden Route","WC WESTERN CAPE"]
[null,"WC051 Laingsburg","WC WESTERN CAPE"]
[null,"WC052 Prince Albert","WC WESTERN CAPE"]
[null,"WC053 Beaufort West","WC WESTERN CAPE"]
[null,"DC5 Central Karoo","WC WESTERN CAPE"]
[]
[]
[]
[]
[]
[]
[]
[]
[]
[]
[]
[]
[]
[]
[]
[]
[]
[]
[]
[]
[]
[null,null,{"$f":"COUNTA(C29:C306)","v":257}]

{"sheet":"Org structure","index":4,"n_rows":56,"n_cols":5,"rows_kept":56,"cut":false,"hidden":false,"merged":[]}
["Organisational Structure Votes",null,"Organisational Structure Sub-Votes",null,"Display Sub-Votes"]
[{"$f":"B2&\" - \"&C2","v":"Vote 01 - Executive & Council"},"Vote 01","Executive & Council"]
[{"$f":"B5&\" - \"&C5","v":"Vote 02 - Municipal Manager"},"01.1","Mayor & Councillors",{"$f":"CONCATENATE(B3, \" - \", C3)","v":"01.1 - Mayor & Councillors"},"01.1 - Mayor & Councillors"]
[{"$f":"B11&\" - \"&C11","v":"Vote 03 - Corporate Services"},"01.2","Mayor & Council Support",{"$f":"CONCATENATE(B4, \" - \", C4)","v":"01.2 - Mayor & Council Support"},"01.2 - Mayor & Council Support"]
[{"$f":"B19&\" - \"&C19","v":"Vote 04 - Budget And Treasury"},"Vote 02","Municipal Manager"]
[{"$f":"B26&\" - \"&C26","v":"Vote 05 - Community Services"},"02.1","Municipal Manager",{"$f":"CONCATENATE(B6, \" - \", C6)","v":"02.1 - Municipal Manager"},"02.1 - Municipal Manager"]
[{"$f":"B35&\" - \"&C35","v":"Vote 06 - Planning And Development"},"02.2","Municipal Manager Support",{"$f":"CONCATENATE(B7, \" - \", C7)","v":"02.2 - Municipal Manager Support"},"02.2 - Municipal Manager Support"]
[{"$f":"B44&\" - \"&C44","v":"Vote 07 - Infrastructure Development"},"02.3","Internal Audit",{"$f":"CONCATENATE(B8, \" - \", C8)","v":"02.3 - Internal Audit"},"02.3 - Internal Audit"]
[{"$f":"B49&\" - \"&C49","v":"Vote 08 - "},"02.4","Communications",{"$f":"CONCATENATE(B9, \" - \", C9)","v":"02.4 - Communications"},"02.4 - Communications"]
["Vote 09 - ","02.5","Risk Management",{"$f":"CONCATENATE(B10, \" - \", C10)","v":"02.5 - Risk Management"},"02.5 - Risk Management"]
["Vote 10 - ","Vote 03","Corporate Services"]
["Vote 11 - ","03.1","Executive Manager: Corporate Services",{"$f":"CONCATENATE(B12, \" - \", C12)","v":"03.1 - Executive Manager: Corporate Services"},"03.1 - Executive Manager: Corporate Services"]
["Vote 12 - ","03.2","Human Resource Management & Development","03.2 - Human Resource Management & Development","03.2 - Human Resource Management & Development"]
["Vote 13 - ","03.3","Information Technology","03.3 - Information Technology","03.3 - Information Technology"]
["Vote 14 - ","03.4","Legal Services","03.4 - Legal Services","03.4 - Legal Services"]
["Vote 15 - Other","03.5","Gen Adm_Sec_Fleet: General Administrat","03.5 - Gen Adm_Sec_Fleet: General Administrat","03.5 - Gen Adm_Sec_Fleet: General Administrat"]
[null,"03.6","Gen Adm_Sec_Fleet: Security Services","03.6 - Gen Adm_Sec_Fleet: Security Services","03.6 - Gen Adm_Sec_Fleet: Security Services"]
[null,"03.7","Gen Adm_Sec_Fleet: Fleet Management","03.7 - Gen Adm_Sec_Fleet: Fleet Management","03.7 - Gen Adm_Sec_Fleet: Fleet Management"]
[null,"Vote 04","Budget And Treasury"]
[null,"04.1","Chief Financial Officer",{"$f":"CONCATENATE(B20, \" - \", C20)","v":"04.1 - Chief Financial Officer"},"04.1 - Chief Financial Officer"]
[null,"04.2","Budget Planning & Management","04.2 - Budget Planning & Management","04.2 - Budget Planning & Management"]
[null,"04.3","Expenditure Management","04.3 - Expenditure Management","04.3 - Expenditure Management"]
[null,"04.4","Revenue Management","04.4 - Revenue Management","04.4 - Revenue Management"]
[null,"04.5","Asset Management","04.5 - Asset Management","04.5 - Asset Management"]
[null,"04.6","Supply Chain Management","04.6 - Supply Chain Management","04.6 - Supply Chain Management"]
[null,"Vote 05","Community Services"]
[null,"05.1","Executive Manager: Community Services",{"$f":"CONCATENATE(B27, \" - \", C27)","v":"05.1 - Executive Manager: Community Services"},"05.1 - Executive Manager: Community Services"]
[null,"05.2","Waste Management Services","05.2 - Waste Management Services","05.2 - Waste Management Services"]
[null,"05.3","Road Traffic & Law Enforce: Traffic Serv","05.3 - Road Traffic & Law Enforce: Traffic Serv","05.3 - Road Traffic & Law Enforce: Traffic Serv"]
[null,"05.4","Road Traffic&Law Enforce: Licencing Serv","05.4 - Road Traffic&Law Enforce: Licencing Serv","05.4 - Road Traffic&Law Enforce: Licencing Serv"]
[null,"05.5","Road Traffic&Law Enforce: Pound","05.5 - Road Traffic&Law Enforce: Pound","05.5 - Road Traffic&Law Enforce: Pound"]
[null,"05.6","Institutional & Social Dev Management","05.6 - Institutional & Social Dev Management","05.6 - Institutional & Social Dev Management"]
[null,"05.7","Libraries And Archives","05.7 - Libraries And Archives","05.7 - Libraries And Archives"]
[null,"05.8","Community Halls And Facilities","05.8 - Community Halls And Facilities","05.8 - Community Halls And Facilities"]
[null,"Vote 06","Planning And Development"]
[null,"06.1","Executive Manager:Planning & Development",{"$f":"CONCATENATE(B36, \" - \", C36)","v":"06.1 - Executive Manager:Planning & Development"},"06.1 - Executive Manager:Planning & Development"]
[null,"06.2","Economic Development & Planning","06.2 - Economic Development & Planning","06.2 - Economic Development & Planning"]
[null,"06.3","Development & Town Planning","06.3 - Development & Town Planning","06.3 - Development & Town Planning"]
[null,"06.4","Property Management & Housing","06.4 - Property Management & Housing","06.4 - Property Management & Housing"]
[null,"06.5","Integrated Development Planning","06.5 - Integrated Development Planning","06.5 - Integrated Development Planning"]
[null,"06.6","Performance Management","06.6 - Performance Management","06.6 - Performance Management"]
[null,"06.7","Environmental Management Services","06.7 - Environmental Management Services","06.7 - Environmental Management Services"]
[null,"06.8","Disaster Management","06.8 - Disaster Management","06.8 - Disaster Management"]
[null,"Vote 07","Infrastructure Development"]
[null,"07.1","Executive Manager: Infrastructure Dev",{"$f":"CONCATENATE(B45, \" - \", C45)","v":"07.1 - Executive Manager: Infrastructure Dev"},"07.1 - Executive Manager: Infrastructure Dev"]
[null,"07.2","Road Construction & Maintenance",{"$f":"CONCATENATE(B46, \" - \", C46)","v":"07.2 - Road Construction & Maintenance"},"07.2 - Road Construction & Maintenance"]
[null,"07.3","Electrical & Mechanical Works",{"$f":"CONCATENATE(B47, \" - \", C47)","v":"07.3 - Electrical & Mechanical Works"},"07.3 - Electrical & Mechanical Works"]
[null,"07.4","Project Management",{"$f":"CONCATENATE(B48, \" - \", C48)","v":"07.4 - Project Management"},"07.4 - Project Management"]
[null,"Vote 08"]
[null,"Vote 09"]
[null,"Vote 10"]
[null,"Vote 11"]
[null,"Vote 12"]
[null,"Vote 13"]
[null,"Vote 14"]
[null,"Vote 15","Other"]

{"sheet":"Contacts","index":5,"n_rows":140,"n_cols":4,"rows_kept":140,"cut":false,"hidden":false,"merged":[[58,2,58,3],[67,2,67,3],[76,0,76,1],[76,2,76,3],[30,2,30,3],[39,0,39,1],[39,2,39,3],[48,0,48,1],[48,2,48,3],[57,0,57,1],[57,2,57,3],[7,2,7,3],[10,2,10,3],[12,2,12,3],[13,0,13,1],[29,0,29,1],[29,2,29,3],[84,0,84,1],[84,2,84,3],[92,0,92,1],[92,2,92,3],[100,0,100,1],[100,2,100,3],[132,0,132,1],[132,2,132,3],[108,0,108,1],[108,2,108,3],[116,0,116,1],[116,2,116,3],[124,0,124,1],[124,2,124,3]]}
[{"$f":"muni&\" - \"&\" Contact Information\"","v":"LIM355 Lepelle-Nkumpi -  Contact Information"}]
[]
["A. GENERAL INFORMATION"]
["Municipality",{"$f":"muni","v":"LIM355 Lepelle-Nkumpi"},"Set name on 'Instructions' sheet"]
[]
["Grade",5,"1 Grade in terms of the Remuneration of Public Office Bearers Act."]
[]
["Province",{"$f":"IF(B4>\" \",VLOOKUP(B4,'Lookup and lists'!B28:C311,2, FALSE),\" \")","v":"LIM LIMPOPO"}]
[]
["Web Address","www.council.gov.za"]
[]
["e-mail Address"]
[]
["B. CONTACT INFORMATION"]
["Postal address:"]
["P.O. Box","Private Bag x 07"]
["City / Town","Chuenespoort"]
["Postal Code",745]
[]
["Street address"]
["Building","Civic Centre"]
["Street No. & Name","170 BA"]
["City / Town","Lebowakgomo"]
["Postal Code",737]
[]
["General Contacts"]
["Telephone number","015 633 4500"]
["Fax number","015 633 6896"]
[]
["C. POLITICAL LEADERSHIP"]
["Speaker:",null,"Secretary/PA to the Speaker:"]
["ID Number","7209075567081","ID Number","7309240363083"]
["Title","Mr","Title","Ms"]
["Name","Cllr Barnard Phukuwe Ntsoane","Name","Jeanette Ramatsobane Mphahlele"]
["Telephone number","015 633 4525","Telephone number","015 633 4525"]
["Cell number","063 495 9777","Cell number","\"0724985740"]
["Fax number","015 633 6896","Fax number","015 633 6896"]
["E-mail address","phukuwe.ntsoane@lepelle-nkumpi.gov.za","E-mail address","jeanette.mphahlel@lepelle-nkumpi.gov.za"]
[]
["Mayor/Executive Mayor:",null,"Secretary/PA to the Mayor/Executive Mayor:"]
["ID Number","\"6806060319088","ID Number","8809211020082"]
["Title","Ms","Title","Ms"]
["Name","MM Molala","Name","Lebogang Kekana"]
["Telephone number","015 633 4520","Telephone number","\"015 633 4518"]
["Cell number","\"0711042289","Cell number","\"0714800336"]
["Fax number","015 633 6896","Fax number","015 633 6896"]
["E-mail address","merriam.molala@lepelle-nkumpi.gov.za","E-mail address","lebogang.kekana@lepelle-nkumpi.gov.za"]
[]
["Deputy Mayor/Executive Mayor:",null,"Secretary/PA to the Deputy Mayor/Executive Mayor:"]
["ID Number",null,"ID Number"]
["Title",null,"Title"]
["Name",null,"Name"]
["Telephone number",null,"Telephone number"]
["Cell number",null,"Cell number"]
["Fax number",null,"Fax number"]
["E-mail address",null,"E-mail address"]
[]
["D. MANAGEMENT LEADERSHIP"]
["Municipal Manager:",null,"Secretary/PA to the Municipal Manager:"]
["ID Number","7905075438088","ID Number","\"8110230738089"]
["Title","Mr","Title","Ms"]
["Name","LA Gafane","Name","Lekgau Theresho"]
["Telephone number","015 633 4508","Telephone number","015 633 4508"]
["Cell number","079 503 5000","Cell number","082 371 9768"]
["Fax number","015 633 6896","Fax number","015 633 6896"]
["E-mail address","tebogo.gafane@lepelle-nkumpi.gov.za","E-mail address","theresho.lekgau@lepelle-nkumpi.gov.za"]
[]
["Chief Financial Officer",null,"Secretary/PA to the Chief Financial Officer"]
["ID Number",null,"ID Number","\"8706271296083"]
["Title","Ms ","Title","Ms"]
["Name","Mankga KG ","Name","Agnes Lehomo"]
["Telephone number","\"015 633 4520","Telephone number","\"0156334537"]
["Cell number","\"064 538 6703","Cell number","\"071 371 9977"]
["Fax number","015 633 6896","Fax number","015 633 6896"]
["E-mail address","khomotjo.mankga@lepelle-nkumpi.gov.za","E-mail address","agnes.lehomo@lepelle-nkumpi.gov.za"]
[]
["Official responsible for submitting financial information",null,"Official responsible for submitting financial information"]
["ID Number","\"7809210399082","ID Number","\"7311295313088"]
["Title","Mrs","Title","Mr"]
["Name","Daphney Moema","Name","Mokgalo Maribe"]
["Telephone number","015 633 4503","Telephone number","015 633 4513"]
["Cell number","071 416 1345","Cell number","072 308 8189"]
["Fax number","015 633 6896","Fax number","015 633 6896"]
["E-mail address","daphney.moroaswi@lepelle-nkumpi.gov.za","E-mail address","mokgalo.maribe@lepelle-nkumpi.gov.za"]
["Official responsible for submitting financial information",null,"Official responsible for submitting financial information"]
["ID Number","\"8801131131081","ID Number"]
["Title","Mrs","Title"]
["Name","Kwena Moila","Name"]
["Telephone number","015 633 4513","Telephone number"]
["Cell number","\"060 528 2863","Cell number"]
["Fax number","015 633 4513","Fax number"]
["E-mail address","kwena.seshoka@lepelle-nkumpi.gov.za","E-mail address"]
["Official responsible for submitting financial information",null,"Official responsible for submitting financial information"]
["ID Number",null,"ID Number"]
["Title",null,"Title"]
["Name",null,"Name"]
["Telephone number",null,"Telephone number"]
["Cell number",null,"Cell number"]
["Fax number",null,"Fax number"]
["E-mail address",null,"E-mail address"]
["Official responsible for submitting financial information",null,"Official responsible for submitting financial information"]
["ID Number",null,"ID Number"]
["Title",null,"Title"]
["Name",null,"Name"]
["Telephone number",null,"Telephone number"]
["Cell number",null,"Cell number"]
["Fax number",null,"Fax number"]
["E-mail address",null,"E-mail address"]
["Official responsible for submitting financial information",null,"Official responsible for submitting financial information"]
["ID Number",null,"ID Number"]
["Title",null,"Title"]
["Name",null,"Name"]
["Telephone number",null,"Telephone number"]
["Cell number",null,"Cell number"]
["Fax number",null,"Fax number"]
["E-mail address",null,"E-mail address"]
["Official responsible for submitting financial information",null,"Official responsible for submitting financial information"]
["ID Number",null,"ID Number"]
["Title",null,"Title"]
["Name",null,"Name"]
["Telephone number",null,"Telephone number"]
["Cell number",null,"Cell number"]
["Fax number",null,"Fax number"]
["E-mail address",null,"E-mail address"]
["Official responsible for submitting financial information",null,"Official responsible for submitting financial information"]
["ID Number",null,"ID Number"]
["Title",null,"Title"]
["Name",null,"Name"]
["Telephone number",null,"Telephone number"]
["Cell number",null,"Cell number"]
["Fax number",null,"Fax number"]
["E-mail address",null,"E-mail address"]
["Official responsible for submitting financial information"]
["ID Number"]
["Title"]
["Name"]
["Telephone number"]
["Cell number"]
["Fax number"]
["E-mail address"]

{"sheet":"C1-Sum","index":6,"n_rows":52,"n_cols":10,"rows_kept":52,"cut":false,"hidden":false,"merged":[[54,0,54,9],[1,0,2,0],[1,2,1,9]]}
[{"$f":"muni& \" - \"&s71sum& \" - \"&date","v":"LIM355 Lepelle-Nkumpi - Table C1 Monthly Budget Statement Summary - M08 February"}]
[{"$f":"desc","v":"Description"},{"$f":"Head1","v":"2019/20"},{"$f":"Head2","v":"Budget Year 2020/21"}]
[null,{"$f":"Head5","v":"Audited Outcome"},{"$f":"Head6","v":"Original Budget"},{"$f":"Head7","v":"Adjusted Budget"},{"$f":"Head38","v":"Monthly actual"},{"$f":"Head39","v":"YearTD actual"},{"$f":"Head40","v":"YearTD budget"},{"$f":"Head41","v":"YTD variance"},{"$f":"Head41","v":"YTD variance"},{"$f":"Head8","v":"Full Year Forecast"}]
["R thousands",null,null,null,null,null,null,null,"%"]
["Financial Performance"]
["Property rates",{"$f":"SUM('C4-FinPerf RE'!C6:C6)","v":8369863.7699999996},{"$f":"SUM('C4-FinPerf RE'!D6:D6)","v":31568339},{"$f":"SUM('C4-FinPerf RE'!E6:E6)","v":31568339},{"$f":"SUM('C4-FinPerf RE'!F6:F6)","v":2616808.89},{"$f":"SUM('C4-FinPerf RE'!G6:G6)","v":20934180.620000001},{"$f":"SUM('C4-FinPerf RE'!H6:H6)","v":21045544},{"$f":"F6-G6","v":-111363.37999999896},{"$f":"IF(H6=0,\"\",H6/G6)","v":-5.2915420005298485E-3},{"$f":"SUM('C4-FinPerf RE'!K6:K6)","v":31568339}]
["Service charges",{"$f":"SUM('C4-FinPerf RE'!C7:C10)","v":23065489.82},{"$f":"SUM('C4-FinPerf RE'!D7:D10)","v":6271577},{"$f":"SUM('C4-FinPerf RE'!E7:E10)","v":6539437},{"$f":"SUM('C4-FinPerf RE'!F7:F10)","v":6092860.1100000003},{"$f":"SUM('C4-FinPerf RE'!G7:G10)","v":51507892.950000003},{"$f":"SUM('C4-FinPerf RE'!H7:H10)","v":4234620},{"$f":"F7-G7","v":47273272.950000003},{"$f":"IF(H7=0,\"\",H7/G7)","v":11.163521862646473},{"$f":"SUM('C4-FinPerf RE'!K7:K10)","v":6539437}]
["Investment revenue",{"$f":"'C4-FinPerf RE'!C13","v":1202955.6399999999},{"$f":"'C4-FinPerf RE'!D13","v":7505491},{"$f":"'C4-FinPerf RE'!E13","v":7505491},{"$f":"'C4-FinPerf RE'!F13","v":198622.24},{"$f":"'C4-FinPerf RE'!G13","v":1141689.27},{"$f":"'C4-FinPerf RE'!H13","v":5003664},{"$f":"F8-G8","v":-3861974.73},{"$f":"IF(H8=0,\"\",H8/G8)","v":-0.77182934945272108},{"$f":"'C4-FinPerf RE'!K13","v":7505491}]
["Transfers and subsidies",{"$f":"'C4-FinPerf RE'!C19","v":105855612.68000001},{"$f":"'C4-FinPerf RE'!D19","v":269853000},{"$f":"'C4-FinPerf RE'!E19","v":323118898},{"$f":"'C4-FinPerf RE'!F19","v":851175.27},{"$f":"'C4-FinPerf RE'!G19","v":254225195.38},{"$f":"'C4-FinPerf RE'!H19","v":211581579},{"$f":"F9-G9","v":42643616.379999995},{"$f":"IF(H9=0,\"\",H9/G9)","v":0.20154692379907041},{"$f":"'C4-FinPerf RE'!K19","v":323118898}]
["Other own revenue",{"$f":"'C4-FinPerf RE'!C12+'C4-FinPerf RE'!C14+'C4-FinPerf RE'!C15+'C4-FinPerf RE'!C16+'C4-FinPerf RE'!C17+'C4-FinPerf RE'!C18+'C4-FinPerf RE'!C20+'C4-FinPerf RE'!C21","v":4652584.0299999993},{"$f":"'C4-FinPerf RE'!D12+'C4-FinPerf RE'!D14+'C4-FinPerf RE'!D15+'C4-FinPerf RE'!D16+'C4-FinPerf RE'!D17+'C4-FinPerf RE'!D18+'C4-FinPerf RE'!D20+'C4-FinPerf RE'!D21","v":75555720},{"$f":"'C4-FinPerf RE'!E12+'C4-FinPerf RE'!E14+'C4-FinPerf RE'!E15+'C4-FinPerf RE'!E16+'C4-FinPerf RE'!E17+'C4-FinPerf RE'!E18+'C4-FinPerf RE'!E20+'C4-FinPerf RE'!E21","v":71904544},{"$f":"'C4-FinPerf RE'!F12+'C4-FinPerf RE'!F14+'C4-FinPerf RE'!F15+'C4-FinPerf RE'!F16+'C4-FinPerf RE'!F17+'C4-FinPerf RE'!F18+'C4-FinPerf RE'!F20+'C4-FinPerf RE'!F21","v":4966100.2399999993},{"$f":"'C4-FinPerf RE'!G12+'C4-FinPerf RE'!G14+'C4-FinPerf RE'!G15+'C4-FinPerf RE'!G16+'C4-FinPerf RE'!G17+'C4-FinPerf RE'!G18+'C4-FinPerf RE'!G20+'C4-FinPerf RE'!G21","v":40174314.229999997},{"$f":"'C4-FinPerf RE'!H12+'C4-FinPerf RE'!H14+'C4-FinPerf RE'!H15+'C4-FinPerf RE'!H16+'C4-FinPerf RE'!H17+'C4-FinPerf RE'!H18+'C4-FinPerf RE'!H20+'C4-FinPerf RE'!H21","v":49640281},{"$f":"F10-G10","v":-9465966.7700000033},{"$f":"IF(H10=0,\"\",H10/G10)","v":-0.19069124064789245},{"$f":"'C4-FinPerf RE'!K12+'C4-FinPerf RE'!K14+'C4-FinPerf RE'!K15+'C4-FinPerf RE'!K16+'C4-FinPerf RE'!K17+'C4-FinPerf RE'!K18+'C4-FinPerf RE'!K20+'C4-FinPerf RE'!K21","v":71904544}]
["Total Revenue (excluding capital transfers and contributions)",{"$f":"SUM(B6:B10)","v":143146505.94},390754127,440636709,14725566.75,367983272.45000005,291505688,{"$f":"F11-G11","v":76477584.450000048},{"$f":"IF(H11=0,\"\",H11/G11)","v":0.26235366100300606},440636709]
["Employee costs",{"$f":"'C4-FinPerf RE'!C25","v":25927135.449999999},{"$f":"'C4-FinPerf RE'!D25","v":117854345},{"$f":"'C4-FinPerf RE'!E25","v":113807212},{"$f":"'C4-FinPerf RE'!F25","v":7986009.1900000004},{"$f":"'C4-FinPerf RE'!G25","v":64747073.219999999},{"$f":"'C4-FinPerf RE'!H25","v":80052485},-15305411.780000001,-0.19119221320862184,{"$f":"'C4-FinPerf RE'!K25","v":113807212}]
["Remuneration of Councillors",{"$f":"'C4-FinPerf RE'!C26","v":3605569.71},{"$f":"'C4-FinPerf RE'!D26","v":23639490},{"$f":"'C4-FinPerf RE'!E26","v":23639472},{"$f":"'C4-FinPerf RE'!F26","v":1872613.37},{"$f":"'C4-FinPerf RE'!G26","v":15141785.039999999},{"$f":"'C4-FinPerf RE'!H26","v":15759653},-617867.96000000089,-3.9205683018528448E-2,{"$f":"'C4-FinPerf RE'!K26","v":23639472}]
["Depreciation & asset impairment",{"$f":"'C4-FinPerf RE'!C28","v":13577.88},{"$f":"'C4-FinPerf RE'!D28","v":32261244},{"$f":"'C4-FinPerf RE'!E28","v":32261244},{"$f":"'C4-FinPerf RE'!F28","v":2447456.92},{"$f":"'C4-FinPerf RE'!G28","v":19577822.149999999},{"$f":"'C4-FinPerf RE'!H28","v":21507488},-1929665.8500000015,-8.9720652174721735E-2,{"$f":"'C4-FinPerf RE'!K28","v":32261244}]
["Finance charges",{"$f":"'C4-FinPerf RE'!C29","v":0},{"$f":"'C4-FinPerf RE'!D29","v":141075},{"$f":"'C4-FinPerf RE'!E29","v":141075},{"$f":"'C4-FinPerf RE'!F29","v":0},{"$f":"'C4-FinPerf RE'!G29","v":0},{"$f":"'C4-FinPerf RE'!H29","v":94048},-94048,-1,{"$f":"'C4-FinPerf RE'!K29","v":141075}]
["Materials and bulk purchases",{"$f":"SUM('C4-FinPerf RE'!C30:C31)","v":1214498},{"$f":"SUM('C4-FinPerf RE'!D30:D31)","v":3765094},{"$f":"SUM('C4-FinPerf RE'!E30:E31)","v":4926250},{"$f":"SUM('C4-FinPerf RE'!F30:F31)","v":7264.14},{"$f":"SUM('C4-FinPerf RE'!G30:G31)","v":329251.01},{"$f":"SUM('C4-FinPerf RE'!H30:H31)","v":3082296},-2753044.99,-0.89317995091970404,{"$f":"SUM('C4-FinPerf RE'!K30:K31)","v":4926250}]
["Transfers and subsidies",{"$f":"'C4-FinPerf RE'!C33","v":0},{"$f":"'C4-FinPerf RE'!D33","v":0},{"$f":"'C4-FinPerf RE'!E33","v":0},{"$f":"'C4-FinPerf RE'!F33","v":0},{"$f":"'C4-FinPerf RE'!G33","v":0},{"$f":"'C4-FinPerf RE'!H33","v":0},0,"",{"$f":"'C4-FinPerf RE'!K33","v":0}]
["Other expenditure",{"$f":"'C4-FinPerf RE'!C36-SUM('C1-Sum'!B12:B17)","v":16547043.5},{"$f":"'C4-FinPerf RE'!D36-SUM('C1-Sum'!C12:C17)","v":132144629},{"$f":"'C4-FinPerf RE'!E36-SUM('C1-Sum'!D12:D17)","v":172662650},{"$f":"'C4-FinPerf RE'!F36-SUM('C1-Sum'!E12:E17)","v":4241749.4500000011},{"$f":"'C4-FinPerf RE'!G36-SUM('C1-Sum'!F12:F17)","v":56184984.229999974},{"$f":"'C4-FinPerf RE'!H36-SUM('C1-Sum'!G12:G17)","v":103986068},-47801083.770000026,-0.45968738591019737,{"$f":"'C4-FinPerf RE'!K36-SUM('C1-Sum'!J12:J17)","v":172662650}]
["Total Expenditure",{"$f":"SUM(B12:B18)","v":47307824.539999999},309805877,347437903,16555093.070000002,155980915.64999998,224482038,-68501122.350000024,-0.30515190863511327,{"$f":"SUM(J12:J18)","v":347437903}]
["Surplus/(Deficit)",{"$f":"B11-B19","v":95838681.400000006},80948250,93198806,-1829526.3200000022,212002356.80000007,67023650,144978706.80000007,2.1630977543001624,{"$f":"J11-J19","v":93198806}]
[{"$f":"'C4-FinPerf RE'!A39","v":"Transfers and subsidies - capital (monetary allocations) (National / Provincial and District)"},{"$f":"'C4-FinPerf RE'!C39","v":3983727.73},{"$f":"'C4-FinPerf RE'!D39","v":53720000},{"$f":"'C4-FinPerf RE'!E39","v":69887541},{"$f":"'C4-FinPerf RE'!F39","v":5500363.5899999999},{"$f":"'C4-FinPerf RE'!G39","v":12341792.029999999},{"$f":"'C4-FinPerf RE'!H39","v":39046844},-26705051.969999999,-0.68392344257067228,{"$f":"'C4-FinPerf RE'!K39","v":69887541}]
[{"$f":"'C4-FinPerf RE'!A40&\" & \"&'C4-FinPerf RE'!A41","v":"Transfers and subsidies - capital (monetary allocations) (National / Provincial Departmental Agencies, Households, Non-profit Institutions, Private Enterprises, Public Corporatons, Higher Educational Institutions) & Transfers and subsidies - capital (in-kind - all) "},{"$f":"SUM('C4-FinPerf RE'!C40:C41)","v":0},{"$f":"SUM('C4-FinPerf RE'!D40:D41)","v":0},{"$f":"SUM('C4-FinPerf RE'!E40:E41)","v":0},{"$f":"SUM('C4-FinPerf RE'!F40:F41)","v":0},{"$f":"SUM('C4-FinPerf RE'!G40:G41)","v":0},{"$f":"SUM('C4-FinPerf RE'!H40:H41)","v":0},0,"",{"$f":"SUM('C4-FinPerf RE'!K40:K41)","v":0}]
["Surplus/(Deficit) after capital transfers & contributions",{"$f":"B20+B21+B22","v":99822409.13000001},134668250,163086347,3670837.2699999977,224344148.83000007,106070494,118273654.83000007,1.1150476477464135,{"$f":"J20+J21+J22","v":163086347}]
["Share of surplus/ (deficit) of associate",{"$f":"'C4-FinPerf RE'!C47","v":0},{"$f":"'C4-FinPerf RE'!D47","v":0},{"$f":"'C4-FinPerf RE'!E47","v":0},{"$f":"'C4-FinPerf RE'!F47","v":0},{"$f":"'C4-FinPerf RE'!G47","v":0},{"$f":"'C4-FinPerf RE'!H47","v":0},0,"",{"$f":"'C4-FinPerf RE'!K47","v":0}]
["Surplus/ (Deficit) for the year",{"$f":"B23+B24","v":99822409.13000001},134668250,163086347,3670837.2699999977,224344148.83000007,106070494,118273654.83000007,1.1150476477464135,{"$f":"J23+J24","v":163086347}]
[]
["Capital expenditure & funds sources"]
["Capital expenditure",{"$f":"'C5-Capex'!C40","v":13767567.819999998},{"$f":"'C5-Capex'!D40","v":134668250},{"$f":"'C5-Capex'!E40","v":164519790},{"$f":"'C5-Capex'!F40","v":1777210.4999999998},{"$f":"'C5-Capex'!G40","v":22436038.920000002},{"$f":"'C5-Capex'!H40","v":106357164},{"$f":"F28-G28","v":-83921125.079999998},{"$f":"IF(H28=0,\"\",H28/G28)","v":-0.7890500453735303},{"$f":"'C5-Capex'!K40","v":164519790}]
["Capital transfers recognised",{"$f":"'C5-Capex'!C70","v":8736597.3699999992},{"$f":"'C5-Capex'!D70","v":54318250},{"$f":"'C5-Capex'!E70","v":67648073},{"$f":"'C5-Capex'!F70","v":3494138.8},{"$f":"'C5-Capex'!G70","v":9884046.3499999996},{"$f":"'C5-Capex'!H70","v":37578140},-27694093.649999999,-0.73697350773614656,{"$f":"'C5-Capex'!K70","v":67648073}]
[]
["Borrowing",{"$f":"'C5-Capex'!C72","v":0},{"$f":"'C5-Capex'!D72","v":0},{"$f":"'C5-Capex'!E72","v":0},{"$f":"'C5-Capex'!F72","v":0},{"$f":"'C5-Capex'!G72","v":0},{"$f":"'C5-Capex'!H72","v":0},0,"",{"$f":"'C5-Capex'!K72","v":0}]
["Internally generated funds",{"$f":"'C5-Capex'!C73","v":5030970.45},{"$f":"'C5-Capex'!D73","v":80350000},{"$f":"'C5-Capex'!E73","v":96871717},{"$f":"'C5-Capex'!F73","v":-1716928.3},{"$f":"'C5-Capex'!G73","v":12551992.57},{"$f":"'C5-Capex'!H73","v":68779024},-56227031.43,-0.81750260704484556,{"$f":"'C5-Capex'!K73","v":96871717}]
["Total sources of capital funds",{"$f":"+B29+B31+B32","v":13767567.82},134668250,164519790,1777210.4999999998,22436038.920000002,106357164,-83921125.079999998,-0.7890500453735303,{"$f":"+J29+J31+J32","v":164519790}]
[]
["Financial position"]
["Total current assets",{"$f":"'C6-FinPos'!C13","v":104634109.08},{"$f":"'C6-FinPos'!D13","v":271110196},{"$f":"'C6-FinPos'!E13","v":523054355},null,{"$f":"'C6-FinPos'!F13","v":408402932.02999997},null,null,null,{"$f":"'C6-FinPos'!G13","v":523054355}]
["Total non current assets",{"$f":"'C6-FinPos'!C25","v":13767567.82},{"$f":"'C6-FinPos'!D25","v":837346338},{"$f":"'C6-FinPos'!E25","v":867197878},null,{"$f":"'C6-FinPos'!F25","v":1051662342.65},null,null,null,{"$f":"'C6-FinPos'!G25","v":867197878}]
["Total current liabilities",{"$f":"'C6-FinPos'!C35","v":18717977.869999997},{"$f":"'C6-FinPos'!D35","v":69136150},{"$f":"'C6-FinPos'!E35","v":69136150},null,{"$f":"'C6-FinPos'!F35","v":169562844.71000001},null,null,null,{"$f":"'C6-FinPos'!G35","v":69136150}]
["Total non current liabilities",{"$f":"'C6-FinPos'!C40","v":0},{"$f":"'C6-FinPos'!D40","v":14246863},{"$f":"'C6-FinPos'!E40","v":14246863},null,{"$f":"'C6-FinPos'!F40","v":238138.31},null,null,null,{"$f":"'C6-FinPos'!G40","v":14246863}]
["Community wealth/Equity",{"$f":"'C6-FinPos'!C48","v":-138710.1},{"$f":"'C6-FinPos'!D48","v":890405271},{"$f":"'C6-FinPos'!E48","v":1000994177},null,{"$f":"'C6-FinPos'!F48","v":1434878391.28},null,null,null,{"$f":"'C6-FinPos'!G48","v":1000994177}]
[]
["Cash flows"]
["Net cash from (used) operating",{"$f":"'C7-CFlow'!C18","v":0},{"$f":"'C7-CFlow'!D18","v":305807865},{"$f":"'C7-CFlow'!E18","v":305807865},{"$f":"'C7-CFlow'!F18","v":20781431.34},{"$f":"'C7-CFlow'!G18","v":453756660.11000001},{"$f":"'C7-CFlow'!H18","v":203871896},{"$f":"G43-F43","v":-249884764.11000001},{"$f":"IF(H43=0,\"\",H43/G43)","v":-1.2256950026599056},{"$f":"'C7-CFlow'!K18","v":305807865}]
["Net cash from (used) investing",{"$f":"'C7-CFlow'!C28","v":0},{"$f":"'C7-CFlow'!D28","v":-134668250},{"$f":"'C7-CFlow'!E28","v":-134668250},{"$f":"'C7-CFlow'!F28","v":-1777210.5},{"$f":"'C7-CFlow'!G28","v":127563961.08},{"$f":"'C7-CFlow'!H28","v":-89778728},{"$f":"G44-F44","v":-217342689.07999998},{"$f":"IF(H44=0,\"\",H44/G44)","v":2.4208706663787884},{"$f":"'C7-CFlow'!K28","v":-134668250}]
["Net cash from (used) financing",{"$f":"'C7-CFlow'!C37","v":5000},{"$f":"'C7-CFlow'!D37","v":-1891836},{"$f":"'C7-CFlow'!E37","v":0},{"$f":"'C7-CFlow'!F37","v":0},{"$f":"'C7-CFlow'!G37","v":-2113252.13},{"$f":"'C7-CFlow'!H37","v":-1257896},{"$f":"G45-F45","v":855356.12999999989},{"$f":"IF(H45=0,\"\",H45/G45)","v":-0.67998954603560224},{"$f":"'C7-CFlow'!K37","v":-1886836}]
["Cash/cash equivalents at the month/year end",{"$f":"'C7-CFlow'!C41","v":5160},{"$f":"'C7-CFlow'!D41","v":174677946},{"$f":"'C7-CFlow'!E41","v":340737545},{"$f":"'C7-CFlow'!F41","v":0},{"$f":"'C7-CFlow'!G41","v":697155936.55000007},{"$f":"'C7-CFlow'!H41","v":112835272},{"$f":"G46-F46","v":-584320664.55000007},{"$f":"IF(H46=0,\"\",H46/G46)","v":-5.1785284352396479},{"$f":"'C7-CFlow'!K41","v":169252779}]
[]
["Debtors & creditors analysis",{"$f":"'SC3'!C3","v":"0-30 Days"},{"$f":"'SC3'!D3","v":"31-60 Days"},{"$f":"'SC3'!E3","v":"61-90 Days"},{"$f":"'SC3'!F3","v":"91-120 Days"},{"$f":"'SC3'!G3","v":"121-150 Dys"},{"$f":"'SC3'!H3","v":"151-180 Dys"},{"$f":"'SC3'!I3","v":"181 Dys-1 Yr"},{"$f":"'SC3'!J3","v":"Over 1Yr"},"Total"]
[{"$f":"LEFT('SC3'!A4,20)","v":"Debtors Age Analysis"}]
[{"$f":"'SC3'!A14","v":"Total By Income Source"},{"$f":"'SC3'!C14","v":0},{"$f":"'SC3'!D14","v":0},{"$f":"'SC3'!E14","v":0},{"$f":"'SC3'!F14","v":0},{"$f":"'SC3'!G14","v":0},{"$f":"'SC3'!H14","v":0},{"$f":"'SC3'!I14","v":0},{"$f":"'SC3'!J14","v":0},{"$f":"'SC3'!K14","v":0}]
[{"$f":"LEFT('SC4'!A5,22)","v":"Creditors Age Analysis"}]
["Total Creditors",{"$f":"'SC4'!C15","v":0},{"$f":"'SC4'!D15","v":0},{"$f":"'SC4'!E15","v":0},{"$f":"'SC4'!F15","v":0},{"$f":"'SC4'!G15","v":0},{"$f":"'SC4'!H15","v":0},{"$f":"'SC4'!I15","v":0},{"$f":"'SC4'!J15","v":0},{"$f":"'SC4'!K15","v":0}]

{"sheet":"C2-FinPerf SC","index":7,"n_rows":55,"n_cols":11,"rows_kept":55,"cut":false,"hidden":false,"merged":[[1,1,2,1],[1,0,2,0],[0,0,0,10],[54,0,54,10]]}
[{"$f":"muni& \" - \"&S71A& \" - \"&date","v":"LIM355 Lepelle-Nkumpi - Table C2 Monthly Budget Statement - Financial Performance (functional classification) - M08 February"}]
[{"$f":"desc","v":"Description"},{"$f":"head27","v":"Ref"},{"$f":"Head1","v":"2019/20"},{"$f":"Head2","v":"Budget Year 2020/21"}]
[null,null,{"$f":"Head5","v":"Audited Outcome"},{"$f":"Head6","v":"Original Budget"},{"$f":"Head7","v":"Adjusted Budget"},{"$f":"Head38","v":"Monthly actual"},{"$f":"Head39","v":"YearTD actual"},{"$f":"Head40","v":"YearTD budget"},{"$f":"Head41","v":"YTD variance"},{"$f":"Head41","v":"YTD variance"},{"$f":"Head8","v":"Full Year Forecast"}]
["R thousands",1,null,null,null,null,null,null,null,"%"]
["Revenue - Functional"]
["Governance and administration",null,{"$f":"SUM(C7:C9)","v":117989986.50000001},364554477,417111807,4526083.47,288328086.00999999,274574195,{"$f":"G6-H6","v":13753891.00999999},{"$f":"IF(I6=0,\"\",I6/H6)","v":5.009171022061993E-2},{"$f":"SUM(K7:K9)","v":417111807}]
["Executive and council",null,{"$f":"'C2C'!C7","v":0},{"$f":"'C2C'!D7","v":0},{"$f":"'C2C'!E7","v":0},{"$f":"'C2C'!F7","v":0},{"$f":"'C2C'!G7","v":0},{"$f":"'C2C'!H7","v":0},0,{"$f":"IF(I7=0,\"\",I7/H7)","v":""},{"$f":"'C2C'!K7","v":0}]
["Finance and administration",null,{"$f":"'C2C'!C10","v":117989986.50000001},{"$f":"'C2C'!D10","v":364554477},{"$f":"'C2C'!E10","v":417111807},{"$f":"'C2C'!F10","v":4526083.47},{"$f":"'C2C'!G10","v":288328086.00999999},{"$f":"'C2C'!H10","v":274574195},13753891.00999999,5.009171022061993E-2,{"$f":"'C2C'!K10","v":417111807}]
["Internal audit",null,{"$f":"'C2C'!C24","v":0},{"$f":"'C2C'!D24","v":0},{"$f":"'C2C'!E24","v":0},{"$f":"'C2C'!F24","v":0},{"$f":"'C2C'!G24","v":0},{"$f":"'C2C'!H24","v":0},0,"",{"$f":"'C2C'!K24","v":0}]
["Community and public safety",null,{"$f":"SUM(C11:C15)","v":-1295749.75},2768785,4430735,11015,692326.51,2178248,-1485921.49,-0.68216359661526138,{"$f":"SUM(K11:K15)","v":4430735}]
["Community and social services",null,{"$f":"'C2C'!C27","v":41217.360000000001},{"$f":"'C2C'!D27","v":135689},{"$f":"'C2C'!E27","v":337135},{"$f":"'C2C'!F27","v":0},{"$f":"'C2C'!G27","v":17800.330000000002},{"$f":"'C2C'!H27","v":130746},-112945.67,-0.8638556437673045,{"$f":"'C2C'!K27","v":337135}]
["Sport and recreation",null,{"$f":"'C2C'!C49","v":0},{"$f":"'C2C'!D49","v":0},{"$f":"'C2C'!E49","v":0},{"$f":"'C2C'!F49","v":0},{"$f":"'C2C'!G49","v":0},{"$f":"'C2C'!H49","v":0},0,"",{"$f":"'C2C'!K49","v":0}]
["Public safety",null,{"$f":"'C2C'!C55","v":-1336967.1100000001},{"$f":"'C2C'!D55","v":2633096},{"$f":"'C2C'!E55","v":4093600},{"$f":"'C2C'!F55","v":11015},{"$f":"'C2C'!G55","v":674526.18},{"$f":"'C2C'!H55","v":2047502},-1372975.8199999998,-0.67056140604502457,{"$f":"'C2C'!K55","v":4093600}]
["Housing",null,{"$f":"'C2C'!C64","v":0},{"$f":"'C2C'!D64","v":0},{"$f":"'C2C'!E64","v":0},{"$f":"'C2C'!F64","v":0},{"$f":"'C2C'!G64","v":0},{"$f":"'C2C'!H64","v":0},{"$f":"G14-H14","v":0},{"$f":"IF(I14=0,\"\",I14/H14)","v":""},{"$f":"'C2C'!K64","v":0}]
["Health",null,{"$f":"'C2C'!C67","v":0},{"$f":"'C2C'!D67","v":0},{"$f":"'C2C'!E67","v":0},{"$f":"'C2C'!F67","v":0},{"$f":"'C2C'!G67","v":0},{"$f":"'C2C'!H67","v":0},0,"",{"$f":"'C2C'!K67","v":0}]
["Economic and environmental services",null,{"$f":"SUM(C17:C19)","v":27319908.579999998},68963312,80526295,14559773.26,86123439.859999999,48288149,37835290.859999999,0.78353160441084624,{"$f":"SUM(K17:K19)","v":80526295}]
["Planning and development",null,{"$f":"'C2C'!C76","v":6113750.0299999993},{"$f":"'C2C'!D76","v":60532862},{"$f":"'C2C'!E76","v":72081732},{"$f":"'C2C'!F76","v":5650790.2699999996},{"$f":"'C2C'!G76","v":13427465.09},{"$f":"'C2C'!H76","v":42665030},-29237564.91,-0.68528171455639431,{"$f":"'C2C'!K76","v":72081732}]
["Road transport",null,{"$f":"'C2C'!C87","v":21206158.550000001},{"$f":"'C2C'!D87","v":8430450},{"$f":"'C2C'!E87","v":8428108},{"$f":"'C2C'!F87","v":8908982.9900000002},{"$f":"'C2C'!G87","v":72695974.769999996},{"$f":"'C2C'!H87","v":5619828},67076146.769999996,11.935622721905368,{"$f":"'C2C'!K87","v":8428108}]
["Environmental protection",null,{"$f":"'C2C'!C92","v":0},{"$f":"'C2C'!D92","v":0},{"$f":"'C2C'!E92","v":16455},{"$f":"'C2C'!F92","v":0},{"$f":"'C2C'!G92","v":0},{"$f":"'C2C'!H92","v":3291},-3291,-1,{"$f":"'C2C'!K92","v":16455}]
["Trading services",null,{"$f":"SUM(C21:C24)","v":3116088.34},{"$f":"SUM(D21:D24)","v":8187553},8455413,1129058.6100000001,5181212.0999999996,5511940,-330727.90000000037,-6.0002086379750207E-2,{"$f":"SUM(K21:K24)","v":8455413}]
["Energy sources",null,{"$f":"'C2C'!C100","v":0},{"$f":"'C2C'!D100","v":0},{"$f":"'C2C'!E100","v":0},{"$f":"'C2C'!F100","v":0},{"$f":"'C2C'!G100","v":0},{"$f":"'C2C'!H100","v":0},{"$f":"G21-H21","v":0},"",{"$f":"'C2C'!K100","v":0}]
["Water management",null,{"$f":"'C2C'!C104","v":0},{"$f":"'C2C'!D104","v":0},{"$f":"'C2C'!E104","v":0},{"$f":"'C2C'!F104","v":0},{"$f":"'C2C'!G104","v":0},{"$f":"'C2C'!H104","v":0},{"$f":"G22-H22","v":0},"",{"$f":"'C2C'!K104","v":0}]
["Waste water management",null,{"$f":"'C2C'!C108","v":0},{"$f":"'C2C'!D108","v":0},{"$f":"'C2C'!E108","v":0},{"$f":"'C2C'!F108","v":0},{"$f":"'C2C'!G108","v":0},{"$f":"'C2C'!H108","v":0},{"$f":"G23-H23","v":0},"",{"$f":"'C2C'!K108","v":0}]
["Waste management",null,{"$f":"'C2C'!C113","v":3116088.34},{"$f":"'C2C'!D113","v":8187553},{"$f":"'C2C'!E113","v":8455413},{"$f":"'C2C'!F113","v":1129058.6100000001},{"$f":"'C2C'!G113","v":5181212.0999999996},{"$f":"'C2C'!H113","v":5511940},{"$f":"G24-H24","v":-330727.90000000037},-6.0002086379750207E-2,{"$f":"'C2C'!K113","v":8455413}]
["Other",4,{"$f":"'C2C'!C118","v":0},{"$f":"'C2C'!D118","v":0},{"$f":"'C2C'!E118","v":0},{"$f":"'C2C'!F118","v":0},{"$f":"'C2C'!G118","v":0},{"$f":"'C2C'!H118","v":0},{"$f":"G25-H25","v":0},"",{"$f":"'C2C'!K118","v":0}]
["Total Revenue - Functional",2,{"$f":"C6+C10+C16+C20+C25","v":147130233.67000002},{"$f":"D6+D10+D16+D20+D25","v":444474127},510524250,20225930.34,380325064.48000002,330552532,49772532.479999989,0.15057374444797775,{"$f":"K6+K10+K16+K20+K25","v":510524250}]
[]
["Expenditure - Functional"]
["Governance and administration",null,{"$f":"SUM(C30:C32)","v":32400614.139999993},208086381,207863246,9818640.2299999986,103547525.56,141948553,{"$f":"G29-H29","v":-38401027.439999998},{"$f":"IF(I29=0,\"\",I29/H29)","v":-0.27052778368230351},{"$f":"SUM(K30:K32)","v":207863246}]
["Executive and council",null,{"$f":"'C2C'!C129","v":3772792.0100000002},{"$f":"'C2C'!D129","v":33064912},{"$f":"'C2C'!E129","v":31765316},{"$f":"'C2C'!F129","v":3220458.01},{"$f":"'C2C'!G129","v":18596327.399999999},{"$f":"'C2C'!H129","v":21783364},-3187036.6000000015,{"$f":"IF(I30=0,\"\",I30/H30)","v":-0.14630598836800421},{"$f":"'C2C'!K129","v":31765316}]
["Finance and administration",null,{"$f":"'C2C'!C132","v":26971381.539999992},{"$f":"'C2C'!D132","v":166892222},{"$f":"'C2C'!E132","v":167460585},{"$f":"'C2C'!F132","v":6078961.9799999995},{"$f":"'C2C'!G132","v":83818745.720000014},{"$f":"'C2C'!H132","v":114644049},-30825303.279999986,-0.26887835477618194,{"$f":"'C2C'!K132","v":167460585}]
["Internal audit",null,{"$f":"'C2C'!C146","v":1656440.59},{"$f":"'C2C'!D146","v":8129247},{"$f":"'C2C'!E146","v":8637345},{"$f":"'C2C'!F146","v":519220.24},{"$f":"'C2C'!G146","v":1132452.44},{"$f":"'C2C'!H146","v":5521140},-4388687.5600000005,-0.79488793256465162,{"$f":"'C2C'!K146","v":8637345}]
["Community and public safety",null,{"$f":"SUM(C34:C38)","v":3193690.2199999997},22163541,27051692,1589991.12,6711590.7999999998,16143956,-9432365.1999999993,-0.58426603739504734,{"$f":"SUM(K34:K38)","v":27051692}]
["Community and social services",null,{"$f":"'C2C'!C149","v":952011.42999999993},{"$f":"'C2C'!D149","v":10592109},{"$f":"'C2C'!E149","v":12964178},{"$f":"'C2C'!F149","v":827749.37000000011},{"$f":"'C2C'!G149","v":5856823.9699999997},{"$f":"'C2C'!H149","v":7655813},-1798989.0300000003,-0.23498340803256301,{"$f":"'C2C'!K149","v":12964178}]
["Sport and recreation",null,{"$f":"'C2C'!C171","v":0},{"$f":"'C2C'!D171","v":0},{"$f":"'C2C'!E171","v":0},{"$f":"'C2C'!F171","v":0},{"$f":"'C2C'!G171","v":0},{"$f":"'C2C'!H171","v":0},0,"",{"$f":"'C2C'!K171","v":0}]
["Public safety",null,{"$f":"'C2C'!C177","v":2241678.79},{"$f":"'C2C'!D177","v":11571432},{"$f":"'C2C'!E177","v":14087514},{"$f":"'C2C'!F177","v":762241.75},{"$f":"'C2C'!G177","v":854766.83},{"$f":"'C2C'!H177","v":8488143},-7633376.1699999999,-0.8992987241143322,{"$f":"'C2C'!K177","v":14087514}]
["Housing",null,{"$f":"'C2C'!C186","v":0},{"$f":"'C2C'!D186","v":0},{"$f":"'C2C'!E186","v":0},{"$f":"'C2C'!F186","v":0},{"$f":"'C2C'!G186","v":0},{"$f":"'C2C'!H186","v":0},0,"",{"$f":"'C2C'!K186","v":0}]
["Health",null,{"$f":"'C2C'!C189","v":0},{"$f":"'C2C'!D189","v":0},{"$f":"'C2C'!E189","v":0},{"$f":"'C2C'!F189","v":0},{"$f":"'C2C'!G189","v":0},{"$f":"'C2C'!H189","v":0},0,"",{"$f":"'C2C'!K189","v":0}]
["Economic and environmental services",null,{"$f":"SUM(C40:C42)","v":7036921.4799999995},41329048,51068929,2854324.1900000004,18622727.229999997,31067835,-12445107.770000003,-0.40057853307126173,{"$f":"SUM(K40:K42)","v":51068929}]
["Planning and development",null,{"$f":"'C2C'!C198","v":1717007.0999999999},{"$f":"'C2C'!D198","v":12232641},{"$f":"'C2C'!E198","v":11883738},{"$f":"'C2C'!F198","v":771925.86},{"$f":"'C2C'!G198","v":3978926.2899999996},{"$f":"'C2C'!H198","v":8085334},-4106407.7100000004,-0.50788349745353756,{"$f":"'C2C'!K198","v":11883738}]
["Road transport",null,{"$f":"'C2C'!C209","v":5078351.1100000003},{"$f":"'C2C'!D209","v":28017889},{"$f":"'C2C'!E209","v":38469054},{"$f":"'C2C'!F209","v":2037905.36},{"$f":"'C2C'!G209","v":14566907.969999999},{"$f":"'C2C'!H209","v":22335962},-7769054.0300000012,-0.34782715112069051,{"$f":"'C2C'!K209","v":38469054}]
["Environmental protection",null,{"$f":"'C2C'!C214","v":241563.27},{"$f":"'C2C'!D214","v":1078518},{"$f":"'C2C'!E214","v":716137},{"$f":"'C2C'!F214","v":44492.97},{"$f":"'C2C'!G214","v":76892.97},{"$f":"'C2C'!H214","v":646539},-569646.03,-0.88106986585496005,{"$f":"'C2C'!K214","v":716137}]
["Trading services",null,{"$f":"SUM(C44:C47)","v":4676598.7},{"$f":"SUM(D44:D47)","v":38226907},61454036,2292137.5300000003,27099072.059999999,35321694,-8222621.9400000013,-0.2327924006136286,{"$f":"SUM(K44:K47)","v":61454036}]
["Energy sources",null,{"$f":"'C2C'!C222","v":1860752.06},{"$f":"'C2C'!D222","v":20083844},{"$f":"'C2C'!E222","v":40829581},{"$f":"'C2C'!F222","v":1098394.04},{"$f":"'C2C'!G222","v":7083709.5700000003},{"$f":"'C2C'!H222","v":21897040},-14813330.43,-0.676499217702484,{"$f":"'C2C'!K222","v":40829581}]
["Water management",null,{"$f":"'C2C'!C226","v":0},{"$f":"'C2C'!D226","v":0},{"$f":"'C2C'!E226","v":0},{"$f":"'C2C'!F226","v":0},{"$f":"'C2C'!G226","v":0},{"$f":"'C2C'!H226","v":0},0,"",{"$f":"'C2C'!K226","v":0}]
["Waste water management",null,{"$f":"'C2C'!C230","v":0},{"$f":"'C2C'!D230","v":0},{"$f":"'C2C'!E230","v":0},{"$f":"'C2C'!F230","v":0},{"$f":"'C2C'!G230","v":0},{"$f":"'C2C'!H230","v":0},0,"",{"$f":"'C2C'!K230","v":0}]
["Waste management",null,{"$f":"'C2C'!C235","v":2815846.64},{"$f":"'C2C'!D235","v":18143063},{"$f":"'C2C'!E235","v":20624455},{"$f":"'C2C'!F235","v":1193743.49},{"$f":"'C2C'!G235","v":20015362.489999998},{"$f":"'C2C'!H235","v":13424654},6590708.4899999984,0.49094065962519395,{"$f":"'C2C'!K235","v":20624455}]
["Other",null,{"$f":"'C2C'!C240","v":0},{"$f":"'C2C'!D240","v":0},{"$f":"'C2C'!E240","v":0},{"$f":"'C2C'!F240","v":0},{"$f":"'C2C'!G240","v":0},{"$f":"'C2C'!H240","v":0},0,"",{"$f":"'C2C'!K240","v":0}]
["Total Expenditure - Functional",3,{"$f":"C29+C33+C39+C43+C48","v":47307824.539999992},{"$f":"D29+D33+D39+D43+D48","v":309805877},347437903,16555093.07,155980915.65000001,224482038,-68501122.350000009,-0.30515190863511321,{"$f":"K29+K33+K39+K43+K48","v":347437903}]
["Surplus/ (Deficit) for the year",null,{"$f":"C26-C49","v":99822409.130000025},134668250,163086347,3670837.2699999996,224344148.83000001,106070494,{"$f":"I26-I49","v":118273654.83},{"$f":"IF(I50=0,\"\",I50/H50)","v":1.1150476477464129},{"$f":"K26-K49","v":163086347}]
[{"$f":"head27a","v":"References"}]
["1. Government Finance Statistics Functions and Sub-functions are standardised to assist the compilation of national and international accounts for comparison purposes"]
["2. Total Revenue by functional classification must reconcile to Total Operating Revenue shown in the Financial Performance Statement"]
["3. Total Expenditure by functional classification must reconcile to total operating expenditure shown in 'Financial Performance Statement'"]
["4. All amounts must be classified under a functional classification (modified GFS). The GFS function 'Other' is only for Abbatoirs, Air Transport, Licensing and Regulation, Markets and Tourism - and if used must be supported by footnotes. Nothing else may be placed under 'Other'. Assign associate share to relevant classification"]

{"sheet":"C2C","index":8,"n_rows":257,"n_cols":11,"rows_kept":257,"cut":false,"hidden":false,"merged":[[252,0,252,10],[0,0,0,10],[1,0,2,0],[1,1,2,1]]}
[{"$f":"muni& \" - \"&S71A& \" - \"&date","v":"LIM355 Lepelle-Nkumpi - Table C2 Monthly Budget Statement - Financial Performance (functional classification) - M08 February"}]
[{"$f":"desc","v":"Description"},{"$f":"head27","v":"Ref"},{"$f":"Head1","v":"2019/20"},{"$f":"Head2","v":"Budget Year 2020/21"}]
[null,null,{"$f":"Head5","v":"Audited Outcome"},{"$f":"Head6","v":"Original Budget"},{"$f":"Head7","v":"Adjusted Budget"},{"$f":"Head38","v":"Monthly actual"},{"$f":"Head39","v":"YearTD actual"},{"$f":"Head40","v":"YearTD budget"},{"$f":"Head41","v":"YTD variance"},{"$f":"Head41","v":"YTD variance"},{"$f":"Head8","v":"Full Year Forecast"}]
["R thousands",1,null,null,null,null,null,null,null,"%"]
["Revenue - Functional"]
["Municipal governance and administration",null,{"$f":"C7+C10+C24","v":117989986.50000001},364554477,417111807,4526083.47,288328086.00999999,274574195,{"$f":"G6-H6","v":13753891.00999999},{"$f":"IF(I6=0,\"\",I6/H6)","v":5.009171022061993E-2},{"$f":"K7+K10+K24","v":417111807}]
["Executive and council",null,{"$f":"SUM(C8:C9)","v":0},{"$f":"SUM(D8:D9)","v":0},0,0,0,0,{"$f":"G7-H7","v":0},{"$f":"IF(I7=0,\"\",I7/H7)","v":""},0]
["Mayor and Council",null,null,null,null,null,null,null,0,""]
["Municipal Manager, Town Secretary and Chief Executive",null,null,null,null,null,null,null,0,""]
["Finance and administration",null,{"$f":"SUM(C11:C23)","v":117989986.50000001},364554477,417111807,4526083.47,288328086.00999999,274574195,{"$f":"G10-H10","v":13753891.00999999},{"$f":"IF(I10=0,\"\",I10/H10)","v":5.009171022061993E-2},{"$f":"SUM(K11:K23)","v":417111807}]
["Administrative and Corporate Support",null,16260.95,99001,201277,4017.38,145869.26,86455,59414.260000000009,0.68722757503903775,201277]
["Asset Management",null,0,40531,40531,0,0,27024,-27024,-1,40531]
["Finance",null,109334313.56,331607059,384162113,1891680.54,266926312.61000001,252608804,14317508.610000014,5.667858120257762E-2,384162113]
["Fleet Management",null,null,null,null,null,null,null,0,""]
["Human Resources",null,0,221930,221930,0,62075,147952,-85877,-0.58043825024332218,221930]
["Information Technology",null,39940.199999999997,209000,209000,695.66,82978.94,139336,{"$f":"G16-H16","v":-56357.06},{"$f":"IF(I16=0,\"\",I16/H16)","v":-0.4044687661480163},209000]
["Legal Services",null,null,null,null,null,null,null,0,""]
["Marketing, Customer Relations, Publicity and Media Co-ordination",null,null,null,null,null,null,null,0,""]
["Property Services",null,8472818.6500000004,32000190,31900190,2629689.89,21106328.469999999,21313448,-207119.53000000119,-9.7177861601746088E-3,31900190]
["Risk Management",null,null,null,null,null,null,null,0,""]
["Security Services",null,0,0,0,0,0,0,0,"",0]
["Supply Chain Management ",null,126653.14,376766,376766,0,4521.7299999999996,251176,-246654.27,-0.98199776252508197,376766]
["Valuation Service",null,null,null,null,null,null,null,0,""]
["Internal audit",null,{"$f":"SUM(C25:C25)","v":0},0,0,0,0,0,0,"",{"$f":"SUM(K25:K25)","v":0}]
["Governance Function",null,null,null,null,null,null,null,0,""]
["Community and public safety",null,{"$f":"C27+C49+C55+C64+C67","v":-1295749.75},{"$f":"D27+D49+D55+D64+D67","v":2768785},4430735,11015,692326.51,2178248,-1485921.49,-0.68216359661526138,4430735]
["Community and social services",null,{"$f":"SUM(C28:C48)","v":41217.360000000001},135689,337135,0,17800.330000000002,130746,-112945.67,-0.8638556437673045,{"$f":"SUM(K28:K48)","v":337135}]
["Aged Care",null,null,null,null,null,null,null,{"$f":"G28-H28","v":0},{"$f":"IF(I28=0,\"\",I28/H28)","v":""}]
["Agricultural",null,null,null,null,null,null,null,0,""]
["Animal Care and Diseases",null,null,null,null,null,null,null,0,""]
["Cemeteries, Funeral Parlours and Crematoriums",null,null,null,null,null,null,null,0,""]
["Child Care Facilities",null,null,null,null,null,null,null,0,""]
["Community Halls and Facilities",null,41217.360000000001,131292,336135,0,17800.330000000002,128497,-110696.67,-0.8614727970302809,336135]
["Consumer Protection",null,null,null,null,null,null,null,0,""]
["Cultural Matters",null,null,null,null,null,null,null,{"$f":"G35-H35","v":0},{"$f":"IF(I35=0,\"\",I35/H35)","v":""}]
["Disaster Management",null,0,0,0,0,0,0,0,"",0]
["Education",null,null,null,null,null,null,null,0,""]
["Indigenous and Customary Law",null,null,null,null,null,null,null,0,""]
["Industrial Promotion",null,null,null,null,null,null,null,0,""]
["Language Policy",null,null,null,null,null,null,null,0,""]
["Libraries and Archives",null,0,4397,1000,0,0,2249,-2249,-1,1000]
["Literacy Programmes",null,null,null,null,null,null,null,0,""]
["Media Services",null,null,null,null,null,null,null,0,""]
["Museums and Art Galleries",null,null,null,null,null,null,null,0,""]
["Population Development",null,null,null,null,null,null,null,0,""]
["Provincial Cultural Matters",null,null,null,null,null,null,null,0,""]
["Theatres",null,null,null,null,null,null,null,0,""]
["Zoo's",null,null,null,null,null,null,null,0,""]
["Sport and recreation",null,{"$f":"SUM(C50:C54)","v":0},{"$f":"SUM(D50:D54)","v":0},0,0,0,0,{"$f":"G49-H49","v":0},{"$f":"IF(I49=0,\"\",I49/H49)","v":""},0]
["Beaches and Jetties ",null,null,null,null,null,null,null,0,""]
["Casinos, Racing, Gambling, Wagering",null,null,null,null,null,null,null,0,""]
["Community Parks (including Nurseries)",null,null,null,null,null,null,null,0,""]
["Recreational Facilities",null,null,null,null,null,null,null,0,""]
["Sports Grounds and Stadiums",null,null,null,null,null,null,null,0,""]
["Public safety",null,{"$f":"SUM(C56:C63)","v":-1336967.1100000001},{"$f":"SUM(D56:D63)","v":2633096},4093600,11015,674526.18,2047502,-1372975.8199999998,-0.67056140604502457,4093600]
["Civil Defence",null,null,null,null,null,null,null,0,""]
["Cleansing",null,null,null,null,null,null,null,0,""]
["Control of Public Nuisances",null,null,null,null,null,null,null,{"$f":"G58-H58","v":0},{"$f":"IF(I58=0,\"\",I58/H58)","v":""}]
["Fencing and Fences ",null,null,null,null,null,null,null,0,""]
["Fire Fighting and Protection",null,null,null,null,null,null,null,0,""]
["Licensing and Control of Animals",null,null,null,null,null,null,null,{"$f":"G61-H61","v":0},{"$f":"IF(I61=0,\"\",I61/H61)","v":""}]
["Police Forces, Traffic and Street Parking Control",null,-1352688.84,2604693,4091600,11015,673474.01,2033846,{"$f":"G62-H62","v":-1360371.99},{"$f":"IF(I62=0,\"\",I62/H62)","v":-0.6688667627735827},4091600]
["Pounds",null,15721.73,28403,2000,0,1052.17,13656,-12603.83,-0.92295181605155241,2000]
["Housing",null,{"$f":"SUM(C65:C66)","v":0},0,0,0,0,0,{"$f":"G64-H64","v":0},{"$f":"IF(I64=0,\"\",I64/H64)","v":""},{"$f":"SUM(K65:K66)","v":0}]
["Housing",null,null,null,null,null,null,null,{"$f":"G65-H65","v":0},{"$f":"IF(I65=0,\"\",I65/H65)","v":""}]
["Informal Settlements",null,null,null,null,null,null,null,{"$f":"G66-H66","v":0},{"$f":"IF(I66=0,\"\",I66/H66)","v":""}]
["Health",null,{"$f":"SUM(C68:C74)","v":0},0,0,0,0,0,0,"",{"$f":"SUM(K68:K74)","v":0}]
["Ambulance",null,null,null,null,null,null,null,0,""]
["Health Services",null,null,null,null,null,null,null,0,""]
["Laboratory Services",null,null,null,null,null,null,null,{"$f":"G70-H70","v":0},{"$f":"IF(I70=0,\"\",I70/H70)","v":""}]
["Food Control",null,null,null,null,null,null,null,{"$f":"G71-H71","v":0},{"$f":"IF(I71=0,\"\",I71/H71)","v":""}]
["Health Surveillance and Prevention of Communicable Diseases including immunizations",null,null,null,null,null,null,null,0,""]
["Vector Control",null,null,null,null,null,null,null,0,""]
["Chemical Safety",null,null,null,null,null,null,null,0,""]
["Economic and environmental services",null,{"$f":"C76+C87+C92","v":27319908.579999998},68963312,80526295,14559773.26,86123439.859999999,48288149,37835290.859999999,0.78353160441084624,{"$f":"K76+K87+K92","v":80526295}]
["Planning and development",null,{"$f":"SUM(C77:C86)","v":6113750.0299999993},60532862,72081732,5650790.2699999996,13427465.09,42665030,-29237564.91,-0.68528171455639431,{"$f":"SUM(K77:K86)","v":72081732}]
["Billboards",null,null,null,null,null,null,null,{"$f":"G77-H77","v":0},{"$f":"IF(I77=0,\"\",I77/H77)","v":""}]
["Corporate Wide Strategic Planning (IDPs, LEDs)",null,0,0,377308,0,0,75461,-75461,-1,377308]
["Central City Improvement District",null,null,null,null,null,null,null,0,""]
["Development Facilitation",null,null,null,null,null,null,null,{"$f":"G80-H80","v":0},{"$f":"IF(I80=0,\"\",I80/H80)","v":""}]
["Economic Development/Planning",null,916808.3,70324,4347,0,13.04,33686,{"$f":"G81-H81","v":-33672.959999999999},{"$f":"IF(I81=0,\"\",I81/H81)","v":-0.99961289556492305},4347]
["Regional Planning and Development",null,null,null,null,null,null,null,{"$f":"G82-H82","v":0},{"$f":"IF(I82=0,\"\",I82/H82)","v":""}]
["Town Planning, Building Regulations and Enforcement, and City Engineer",null,1213214,6742538,1812536,150426.68,1085660.02,3509039,{"$f":"G83-H83","v":-2423378.98},{"$f":"IF(I83=0,\"\",I83/H83)","v":-0.69061044348609402},1812536]
["Project Management Unit",null,3983727.73,53720000,69887541,5500363.5899999999,12341792.029999999,39046844,-26705051.969999999,-0.68392344257067228,69887541]
["Provincial Planning",null,null,null,null,null,null,null,0,""]
["Support to Local Municipalities",null,null,null,null,null,null,null,0,""]
["Road transport",null,{"$f":"SUM(C88:C91)","v":21206158.550000001},8430450,8428108,8908982.9900000002,72695974.769999996,5619828,67076146.769999996,11.935622721905368,{"$f":"SUM(K88:K91)","v":8428108}]
["Public Transport",null,null,null,null,null,null,null,0,""]
["Road and Traffic Regulation",null,963757.07,8430450,8428108,599146.35,4666107.8600000003,5619828,-953720.13999999966,-0.16970628638456545,8428108]
["Roads",null,20242401.48,0,0,8309836.6399999997,68029866.909999996,0,68029866.909999996,{"$error":"#DIV/0!"},0]
["Taxi Ranks",null,null,null,null,null,null,null,0,""]
["Environmental protection",null,{"$f":"SUM(C93:C98)","v":0},{"$f":"SUM(D93:D98)","v":0},16455,0,0,3291,-3291,-1,16455]
["Biodiversity and Landscape",null,null,null,null,null,null,null,0,""]
["Coastal Protection",null,null,null,null,null,null,null,0,""]
["Indigenous Forests",null,null,null,null,null,null,null,{"$f":"G95-H95","v":0},{"$f":"IF(I95=0,\"\",I95/H95)","v":""}]
["Nature Conservation",null,null,null,null,null,null,null,{"$f":"G96-H96","v":0},{"$f":"IF(I96=0,\"\",I96/H96)","v":""}]
["Pollution Control",null,0,0,16455,0,0,3291,-3291,-1,16455]
["Soil Conservation",null,null,null,null,null,null,null,0,""]
["Trading services",null,{"$f":"C100+C104+C108+C113","v":3116088.34},{"$f":"D100+D104+D108+D113","v":8187553},8455413,1129058.6100000001,5181212.0999999996,5511940,-330727.90000000037,-6.0002086379750207E-2,{"$f":"K100+K104+K108+K113","v":8455413}]
["Energy sources",null,{"$f":"SUM(C101:C103)","v":0},{"$f":"SUM(D101:D103)","v":0},0,0,0,0,0,"",0]
["Electricity ",null,0,0,0,0,0,0,0,"",0]
["Street Lighting and Signal Systems",null,null,null,null,null,null,null,{"$f":"G102-H102","v":0},{"$f":"IF(I102=0,\"\",I102/H102)","v":""}]
["Nonelectric Energy",null,null,null,null,null,null,null,0,""]
["Water management",null,{"$f":"SUM(C105:C107)","v":0},{"$f":"SUM(D105:D107)","v":0},0,0,0,0,0,"",0]
["Water Treatment",null,null,null,null,null,null,null,0,""]
["Water Distribution",null,null,null,null,null,null,null,{"$f":"G106-H106","v":0},{"$f":"IF(I106=0,\"\",I106/H106)","v":""}]
["Water Storage",null,null,null,null,null,null,null,0,""]
["Waste water management",null,{"$f":"SUM(C109:C112)","v":0},{"$f":"SUM(D109:D112)","v":0},0,0,0,0,0,"",0]
["Public Toilets",null,null,null,null,null,null,null,0,""]
["Sewerage",null,null,null,null,null,null,null,0,""]
["Storm Water Management",null,null,null,null,null,null,null,{"$f":"G111-H111","v":0},{"$f":"IF(I111=0,\"\",I111/H111)","v":""}]
["Waste Water Treatment",null,null,null,null,null,null,null,0,""]
["Waste management",null,{"$f":"SUM(C114:C117)","v":3116088.34},8187553,8455413,1129058.6100000001,5181212.0999999996,5511940,-330727.90000000037,-6.0002086379750207E-2,{"$f":"SUM(K114:K117)","v":8455413}]
["Recycling",null,null,null,null,null,null,null,{"$f":"G114-H114","v":0},{"$f":"IF(I114=0,\"\",I114/H114)","v":""}]
["Solid Waste Disposal (Landfill Sites)",null,null,null,null,null,null,null,{"$f":"G115-H115","v":0},{"$f":"IF(I115=0,\"\",I115/H115)","v":""}]
["Solid Waste Removal",null,3116088.34,8187553,8455413,1129058.6100000001,5181212.0999999996,5511940,-330727.90000000037,-6.0002086379750207E-2,8455413]
["Street Cleaning",null,null,null,null,null,null,null,{"$f":"G117-H117","v":0},{"$f":"IF(I117=0,\"\",I117/H117)","v":""}]
["Other",null,{"$f":"SUM(C119:C124)","v":0},{"$f":"SUM(D119:D124)","v":0},0,0,0,0,0,"",0]
["Abattoirs",null,null,null,null,null,null,null,0,""]
["Air Transport",null,null,null,null,null,null,null,0,""]
["Forestry ",null,null,null,null,null,null,null,{"$f":"G121-H121","v":0},{"$f":"IF(I121=0,\"\",I121/H121)","v":""}]
["Licensing and Regulation",null,null,null,null,null,null,null,0,""]
["Markets",null,null,null,null,null,null,null,0,""]
["Tourism",null,null,null,null,null,null,null,{"$f":"G124-H124","v":0},{"$f":"IF(I124=0,\"\",I124/H124)","v":""}]
[{"$f":"\"Total \"&A5","v":"Total Revenue - Functional"},2,{"$f":"C6+C26+C75+C99+C118","v":147130233.67000002},444474127,510524250,20225930.34,380325064.48000002,330552532,{"$f":"G125-H125","v":49772532.480000019},{"$f":"IF(I125=0,\"\",I125/H125)","v":0.15057374444797786},{"$f":"K6+K26+K75+K99+K118","v":510524250}]
[]
["Expenditure - Functional"]
[{"$f":"A6","v":"Municipal governance and administration"},null,{"$f":"C129+C132+C146","v":32400614.139999993},208086381,207863246,9818640.2299999986,103547525.56,141948553,{"$f":"G128-H128","v":-38401027.439999998},{"$f":"IF(I128=0,\"\",I128/H128)","v":-0.27052778368230351},{"$f":"K129+K132+K146","v":207863246}]
["Executive and council",null,{"$f":"SUM(C130:C131)","v":3772792.0100000002},33064912,31765316,3220458.01,18596327.399999999,21783364,-3187036.6000000015,-0.14630598836800421,31765316]
["Mayor and Council",null,3744580.79,31605649,31380933,3218458.01,18431901.079999998,21025500,-2593598.9200000018,-0.12335492235618661,31380933]
["Municipal Manager, Town Secretary and Chief Executive",null,28211.22,1459263,384383,2000,164426.32,757864,-593437.67999999993,-0.78303980661437933,384383]
["Finance and administration",null,{"$f":"SUM(C133:C145)","v":26971381.539999992},166892222,167460585,6078961.9799999995,83818745.720000014,114644049,-30825303.279999986,-0.26887835477618194,{"$f":"SUM(K133:K145)","v":167460585}]
["Administrative and Corporate Support",null,12624353.630000001,61939662,47810524,1706529.14,28545642.469999999,39209562,-10663919.530000001,-0.27197242167612079,47810524]
["Asset Management",null,1492531.8,7487183,7275584,218663.96,3830191.54,4949129,-1118937.46,-0.22608775402702172,7275584]
["Finance",null,3779667.25,45427046,48480852,1134150.8799999999,16971350.670000002,31299995,-14328644.329999998,-0.45778423702623589,48480852]
["Fleet Management",null,595504.93000000005,5035205,13246823,474070.89,2472837.6,4999123,-2526285.4,-0.50534571763887381,13246823]
["Human Resources",null,2073196.74,8864309,9181262,340657.45,5358078.47,6400656,-1042577.5300000003,-0.16288604324306763,9181262]
["Information Technology",null,1063297.72,7851479,6041293,250613.13,2517805.2599999998,4860850,-2343044.7400000002,-0.48202366664266544,6041293]
["Legal Services",null,1366637.65,6150372,12129478,311914.52,7010714.21,6107504,903210.21,0.1478853243485391,12129478]
["Marketing, Customer Relations, Publicity and Media Co-ordination",null,1000010.49,2023274,3693842,114189.87,10598643.9,1682958,8915685.9000000004,5.2976282830587573,3693842]
["Property Services",null,2025425.08,15465860,11417490,407779.49,3659446.5,9500902,-5841455.5,-0.61483167598192257,11417490]
["Risk Management",null,350991.52,2963625,4377586,1086798.5900000001,2820201.04,2858545,-38343.959999999963,-1.3413803176091321E-2,4377586]
["Security Services",null,0,0,207970,0,0,41592,-41592,-1,207970]
["Supply Chain Management ",null,599764.73,3684207,3597881,33594.06,33834.06,2733233,-2699398.94,-0.98762123097445409,3597881]
["Valuation Service",null,null,null,null,null,null,null,0,""]
["Internal audit",null,{"$f":"SUM(C147:C147)","v":1656440.59},8129247,8637345,519220.24,1132452.44,5521140,-4388687.5600000005,-0.79488793256465162,{"$f":"SUM(K147:K147)","v":8637345}]
["Governance Function",null,1656440.59,8129247,8637345,519220.24,1132452.44,5521140,-4388687.5600000005,-0.79488793256465162,8637345]
["Community and public safety",null,{"$f":"C149+C171+C177+C186+C189","v":3193690.2199999997},22163541,27051692,1589991.12,6711590.7999999998,16143956,-9432365.1999999993,-0.58426603739504734,{"$f":"K149+K171+K177+K186+K189","v":27051692}]
["Community and social services",null,{"$f":"SUM(C150:C170)","v":952011.42999999993},10592109,12964178,827749.37000000011,5856823.9699999997,7655813,-1798989.0300000003,-0.23498340803256301,{"$f":"SUM(K150:K170)","v":12964178}]
["Aged Care",null,null,null,null,null,null,null,0,""]
["Agricultural",null,null,null,null,null,null,null,0,""]
["Animal Care and Diseases",null,null,null,null,null,null,null,0,""]
["Cemeteries, Funeral Parlours and Crematoriums",null,null,null,null,null,null,null,0,""]
["Child Care Facilities",null,null,null,null,null,null,null,0,""]
["Community Halls and Facilities",null,512621.55,8615799,10718614,688179.56,5087351.13,6164435,-1077083.8700000001,-0.17472548092404253,10718614]
["Consumer Protection",null,null,null,null,null,null,null,0,""]
["Cultural Matters",null,null,null,null,null,null,null,{"$f":"G157-H157","v":0},{"$f":"IF(I157=0,\"\",I157/H157)","v":""}]
["Disaster Management",null,292926.61,748961,1053215,70697.919999999998,218497.72,680154,{"$f":"G158-H158","v":-461656.28},{"$f":"IF(I158=0,\"\",I158/H158)","v":-0.67875257662235322},1053215]
["Education",null,null,null,null,null,null,null,{"$f":"G159-H159","v":0},{"$f":"IF(I159=0,\"\",I159/H159)","v":""}]
[{"$f":"A38","v":"Indigenous and Customary Law"},null,null,null,null,null,null,null,0,""]
["Industrial Promotion",null,null,null,null,null,null,null,0,""]
["Language Policy",null,null,null,null,null,null,null,0,""]
["Libraries and Archives",null,146463.26999999999,1227349,1192349,68871.89,550975.12,811224,-260248.88,-0.32081013382247076,1192349]
["Literacy Programmes",null,null,null,null,null,null,null,0,""]
["Media Services",null,null,null,null,null,null,null,0,""]
["Museums and Art Galleries",null,null,null,null,null,null,null,0,""]
["Population Development",null,null,null,null,null,null,null,0,""]
["Provincial Cultural Matters",null,null,null,null,null,null,null,0,""]
["Theatres",null,null,null,null,null,null,null,0,""]
["Zoo's",null,null,null,null,null,null,null,0,""]
["Sport and recreation",null,{"$f":"SUM(C172:C176)","v":0},0,0,0,0,0,{"$f":"G171-H171","v":0},{"$f":"IF(I171=0,\"\",I171/H171)","v":""},0]
["Beaches and Jetties ",null,null,null,null,null,null,null,0,""]
["Casinos, Racing, Gambling, Wagering",null,null,null,null,null,null,null,0,""]
["Community Parks (including Nurseries)",null,null,null,null,null,null,null,0,""]
["Recreational Facilities",null,null,null,null,null,null,null,0,""]
["Sports Grounds and Stadiums",null,null,null,null,null,null,null,0,""]
["Public safety",null,{"$f":"SUM(C178:C185)","v":2241678.79},11571432,14087514,762241.75,854766.83,8488143,-7633376.1699999999,-0.8992987241143322,14087514]
["Civil Defence",null,null,null,null,null,null,null,0,""]
["Cleansing",null,null,null,null,null,null,null,0,""]
["Control of Public Nuisances",null,null,null,null,null,null,null,{"$f":"G180-H180","v":0},{"$f":"IF(I180=0,\"\",I180/H180)","v":""}]
["Fencing and Fences ",null,null,null,null,null,null,null,0,""]
["Fire Fighting and Protection",null,null,null,null,null,null,null,0,""]
["Licensing and Control of Animals",null,null,null,null,null,null,null,{"$f":"G183-H183","v":0},{"$f":"IF(I183=0,\"\",I183/H183)","v":""}]
["Police Forces, Traffic and Street Parking Control",null,2021983.83,10813045,13427354,713508.79,806033.87,8002196,{"$f":"G184-H184","v":-7196162.1299999999},{"$f":"IF(I184=0,\"\",I184/H184)","v":-0.89927341569739105},13427354]
["Pounds",null,219694.96,758387,660160,48732.959999999999,48732.959999999999,485947,-437214.04,-0.89971548337575902,660160]
["Housing",null,{"$f":"SUM(C187:C188)","v":0},0,0,0,0,0,{"$f":"G186-H186","v":0},{"$f":"IF(I186=0,\"\",I186/H186)","v":""},{"$f":"SUM(K187:K188)","v":0}]
["Housing",null,null,null,null,null,null,null,{"$f":"G187-H187","v":0},{"$f":"IF(I187=0,\"\",I187/H187)","v":""}]
["Informal Settlements",null,null,null,null,null,null,null,{"$f":"G188-H188","v":0},{"$f":"IF(I188=0,\"\",I188/H188)","v":""}]
["Health",null,{"$f":"SUM(C190:C196)","v":0},0,0,0,0,0,0,"",0]
["Ambulance",null,null,null,null,null,null,null,0,""]
["Health Services",null,null,null,null,null,null,null,0,""]
[{"$f":"A70","v":"Laboratory Services"},null,null,null,null,null,null,null,0,""]
["Food Control",null,null,null,null,null,null,null,{"$f":"G193-H193","v":0},{"$f":"IF(I193=0,\"\",I193/H193)","v":""}]
["Health Surveillance and Prevention of Communicable Diseases including immunizations",null,null,null,null,null,null,null,{"$f":"G194-H194","v":0},{"$f":"IF(I194=0,\"\",I194/H194)","v":""}]
["Vector Control",null,null,null,null,null,null,null,0,""]
["Chemical Safety",null,null,null,null,null,null,null,0,""]
["Economic and environmental services",null,{"$f":"C198+C209+C214","v":7036921.4799999995},41329048,51068929,2854324.1900000004,18622727.229999997,31067835,-12445107.770000003,-0.40057853307126173,{"$f":"K198+K209+K214","v":51068929}]
["Planning and development",null,{"$f":"SUM(C199:C208)","v":1717007.0999999999},12232641,11883738,771925.86,3978926.2899999996,8085334,-4106407.7100000004,-0.50788349745353756,11883738]
["Billboards",null,null,null,null,null,null,null,0,""]
["Corporate Wide Strategic Planning (IDPs, LEDs)",null,479618.25,2927913,2608995,155915.59,329511.59000000003,1888162,-1558650.41,-0.82548553037292349,2608995]
["Central City Improvement District",null,null,null,null,null,null,null,0,""]
["Development Facilitation",null,null,null,null,null,null,null,{"$f":"G202-H202","v":0},{"$f":"IF(I202=0,\"\",I202/H202)","v":""}]
["Economic Development/Planning",null,566638.86,2783408,2438883,181598.7,2116347.98,1786713,{"$f":"G203-H203","v":329634.98},{"$f":"IF(I203=0,\"\",I203/H203)","v":0.18449240588723537},2438883]
["Regional Planning and Development",null,null,null,null,null,null,null,{"$f":"G204-H204","v":0},{"$f":"IF(I204=0,\"\",I204/H204)","v":""}]
["Town Planning, Building Regulations and Enforcement, and City Engineer",null,645192.98,3869570,4596393,249519.84,249519.84,2725083,{"$f":"G205-H205","v":-2475563.16},{"$f":"IF(I205=0,\"\",I205/H205)","v":-0.90843587516416935},4596393]
["Project Management Unit",null,25557.01,2651750,2239467,184891.73,1283546.8799999999,1685376,{"$f":"G206-H206","v":-401829.12000000011},{"$f":"IF(I206=0,\"\",I206/H206)","v":-0.23842105263157901},2239467]
["Provincial Planning",null,null,null,null,null,null,null,0,""]
["Support to Local Municipalities",null,null,null,null,null,null,null,0,""]
["Road transport",null,{"$f":"SUM(C210:C213)","v":5078351.1100000003},28017889,38469054,2037905.36,14566907.969999999,22335962,-7769054.0300000012,-0.34782715112069051,{"$f":"SUM(K210:K213)","v":38469054}]
["Public Transport",null,null,null,null,null,null,null,0,""]
["Road and Traffic Regulation",null,2270181.16,8368309,8247217,573700.49,751071.04,5554663,{"$f":"G211-H211","v":-4803591.96},{"$f":"IF(I211=0,\"\",I211/H211)","v":-0.86478548923670073},8247217]
["Roads",null,2808169.95,19649580,30221837,1464204.87,13815836.93,16781299,-2965462.0700000003,-0.17671230755139994,30221837]
["Taxi Ranks",null,null,null,null,null,null,null,0,""]
["Environmental protection",null,{"$f":"SUM(C215:C220)","v":241563.27},1078518,716137,44492.97,76892.97,646539,-569646.03,-0.88106986585496005,716137]
["Biodiversity and Landscape",null,null,null,null,null,null,null,0,""]
["Coastal Protection",null,null,null,null,null,null,null,0,""]
["Indigenous Forests",null,null,null,null,null,null,null,0,""]
["Nature Conservation",null,null,null,null,null,null,null,{"$f":"G218-H218","v":0},{"$f":"IF(I218=0,\"\",I218/H218)","v":""}]
["Pollution Control",null,241563.27,1078518,716137,44492.97,76892.97,646539,{"$f":"G219-H219","v":-569646.03},{"$f":"IF(I219=0,\"\",I219/H219)","v":-0.88106986585496005},716137]
["Soil Conservation",null,null,null,null,null,null,null,0,""]
["Trading services",null,{"$f":"C222+C226+C230+C235","v":4676598.7},{"$f":"D222+D226+D230+D235","v":38226907},61454036,2292137.5300000003,27099072.059999999,35321694,-8222621.9400000013,-0.2327924006136286,{"$f":"K222+K226+K230+K235","v":61454036}]
["Energy sources",null,{"$f":"SUM(C223:C225)","v":1860752.06},20083844,40829581,1098394.04,7083709.5700000003,21897040,-14813330.43,-0.676499217702484,40829581]
["Electricity ",null,1860752.06,20083844,40829581,1098394.04,7083709.5700000003,21897040,-14813330.43,-0.676499217702484,40829581]
[{"$f":"A102","v":"Street Lighting and Signal Systems"},null,null,null,null,null,null,null,{"$f":"G224-H224","v":0},{"$f":"IF(I224=0,\"\",I224/H224)","v":""}]
["Nonelectric Energy",null,null,null,null,null,null,null,0,""]
["Water management",null,{"$f":"SUM(C227:C229)","v":0},0,0,0,0,0,0,"",0]
["Water Treatment",null,null,null,null,null,null,null,0,""]
["Water Distribution",null,null,null,null,null,null,null,{"$f":"G228-H228","v":0},{"$f":"IF(I228=0,\"\",I228/H228)","v":""}]
["Water Storage",null,null,null,null,null,null,null,0,""]
["Waste water management",null,{"$f":"SUM(C231:C234)","v":0},0,0,0,0,0,0,"",0]
["Public Toilets",null,null,null,null,null,null,null,0,""]
["Sewerage",null,null,null,null,null,null,null,0,""]
["Storm Water Management",null,null,null,null,null,null,null,{"$f":"G233-H233","v":0},{"$f":"IF(I233=0,\"\",I233/H233)","v":""}]
["Waste Water Treatment",null,null,null,null,null,null,null,0,""]
["Waste management",null,{"$f":"SUM(C236:C239)","v":2815846.64},18143063,20624455,1193743.49,20015362.489999998,13424654,6590708.4899999984,0.49094065962519395,{"$f":"SUM(K236:K239)","v":20624455}]
["Recycling",null,null,null,null,null,null,null,{"$f":"G236-H236","v":0},{"$f":"IF(I236=0,\"\",I236/H236)","v":""}]
["Solid Waste Disposal (Landfill Sites)",null,null,null,null,null,null,null,{"$f":"G237-H237","v":0},{"$f":"IF(I237=0,\"\",I237/H237)","v":""}]
["Solid Waste Removal",null,2815846.64,18143063,20624455,1193743.49,20015362.489999998,13424654,{"$f":"G238-H238","v":6590708.4899999984},{"$f":"IF(I238=0,\"\",I238/H238)","v":0.49094065962519395},20624455]
["Street Cleaning",null,null,null,null,null,null,null,0,""]
["Other",null,{"$f":"SUM(C241:C246)","v":0},0,0,0,0,0,0,"",0]
["Abattoirs",null,null,null,null,null,null,null,0,""]
["Air Transport",null,null,null,null,null,null,null,0,""]
["Forestry ",null,null,null,null,null,null,null,{"$f":"G243-H243","v":0},{"$f":"IF(I243=0,\"\",I243/H243)","v":""}]
["Licensing and Regulation",null,null,null,null,null,null,null,0,""]
["Markets",null,null,null,null,null,null,null,{"$f":"G245-H245","v":0},{"$f":"IF(I245=0,\"\",I245/H245)","v":""}]
["Tourism",null,null,null,null,null,null,null,{"$f":"G246-H246","v":0},{"$f":"IF(I246=0,\"\",I246/H246)","v":""}]
[{"$f":"\"Total \"&A127","v":"Total Expenditure - Functional"},3,{"$f":"C128+C148+C197+C221+C240","v":47307824.539999992},309805877,347437903,16555093.07,155980915.65000001,224482038,-68501122.350000009,{"$f":"IF(I247=0,\"\",I247/H247)","v":-0.30515190863511321},{"$f":"K128+K148+K197+K221+K240","v":347437903}]
[{"$f":"result","v":"Surplus/ (Deficit) for the year"},null,{"$f":"C125-C247","v":99822409.130000025},134668250,163086347,3670837.2699999996,224344148.83000001,106070494,{"$f":"G248-H248","v":118273654.83000001},{"$f":"IF(I248=0,\"\",I248/H248)","v":1.1150476477464131},{"$f":"K125-K247","v":163086347}]
[{"$f":"head27a","v":"References"}]
["1. Government Finance Statistics Functions and Sub-functions are standardised to assist national and international accounts and comparison"]
["2. Total Revenue by Functional Classification must reconcile to total operating revenue shown in Financial Performance (revenue and expenditure)"]
["3. Total Expenditure by Functional Classification must reconcile to total operating expenditure shown in Financial Performance (revenue and expenditure)"]
["4. All amounts must be classified under a Functional classification. The function 'Other' is only for Abbatoirs, Air Transport, Licensing and Regulation, Markets and Tourism - and if used must be supported by footnotes. Nothing else may be placed under 'Other'. Assign associate share to relevant classification"]
[]
[]
["check oprev balance",null,{"$f":"C125-'C4-FinPerf RE'!C53","v":0},{"$f":"D125-'C4-FinPerf RE'!D53","v":0},{"$f":"E125-'C4-FinPerf RE'!E53","v":0},{"$f":"F125-'C4-FinPerf RE'!F53","v":0},{"$f":"G125-'C4-FinPerf RE'!G53","v":0},{"$f":"H125-'C4-FinPerf RE'!H53","v":0},{"$f":"I125-'C4-FinPerf RE'!I53","v":49772532.480000019},null,{"$f":"K125-'C4-FinPerf RE'!K53","v":0}]
["check opexp balance",null,{"$f":"C247-'C4-FinPerf RE'!C36","v":0},{"$f":"D247-'C4-FinPerf RE'!D36","v":0},{"$f":"E247-'C4-FinPerf RE'!E36","v":0},{"$f":"F247-'C4-FinPerf RE'!F36","v":0},{"$f":"G247-'C4-FinPerf RE'!G36","v":0},{"$f":"H247-'C4-FinPerf RE'!H36","v":0},{"$f":"I247-'C4-FinPerf RE'!I36","v":0},null,{"$f":"K247-'C4-FinPerf RE'!K36","v":0}]

{"sheet":"C3-FinPerf V","index":9,"n_rows":43,"n_cols":11,"rows_kept":43,"cut":false,"hidden":false,"merged":[[0,0,0,10],[1,1,3,1],[1,3,1,10]]}
[{"$f":"muni& \" - \"&S71C& \" - \"&date","v":"LIM355 Lepelle-Nkumpi - Table C3 Monthly Budget Statement - Financial Performance (revenue and expenditure by municipal vote) - M08 February"}]
[{"$f":"Vdesc","v":"Vote Description"},{"$f":"head27","v":"Ref"},{"$f":"Head1","v":"2019/20"},{"$f":"Head2","v":"Budget Year 2020/21"}]
[null,null,{"$f":"Head5","v":"Audited Outcome"},{"$f":"Head6","v":"Original Budget"},{"$f":"Head7","v":"Adjusted Budget"},{"$f":"Head38","v":"Monthly actual"},{"$f":"Head39","v":"YearTD actual"},{"$f":"Head40","v":"YearTD budget"},{"$f":"Head41","v":"YTD variance"},{"$f":"Head41","v":"YTD variance"},{"$f":"Head8","v":"Full Year Forecast"}]
["R thousands",null,null,null,null,null,null,null,null,"%"]
["Revenue by Vote",1]
[{"$f":"'Org structure'!A2","v":"Vote 01 - Executive & Council"},null,{"$f":"'C3C'!C6","v":0},{"$f":"'C3C'!D6","v":0},{"$f":"'C3C'!E6","v":0},{"$f":"'C3C'!F6","v":0},{"$f":"'C3C'!G6","v":0},{"$f":"'C3C'!H6","v":0},{"$f":"G6-H6","v":0},{"$f":"IF(I6=0,\"\",I6/H6)","v":""},{"$f":"'C3C'!K6","v":0}]
[{"$f":"'Org structure'!A3","v":"Vote 02 - Municipal Manager"},null,{"$f":"'C3C'!C9","v":0},{"$f":"'C3C'!D9","v":0},{"$f":"'C3C'!E9","v":0},{"$f":"'C3C'!F9","v":0},{"$f":"'C3C'!G9","v":0},{"$f":"'C3C'!H9","v":0},0,"",{"$f":"'C3C'!K9","v":0}]
[{"$f":"'Org structure'!A4","v":"Vote 03 - Corporate Services"},null,{"$f":"'C3C'!C15","v":39940.199999999997},{"$f":"'C3C'!D15","v":430930},{"$f":"'C3C'!E15","v":430930},{"$f":"'C3C'!F15","v":695.66},{"$f":"'C3C'!G15","v":145053.94},{"$f":"'C3C'!H15","v":287288},-142234.06,-0.49509224193144163,{"$f":"'C3C'!K15","v":430930}]
[{"$f":"'Org structure'!A5","v":"Vote 04 - Budget And Treasury"},null,{"$f":"'C3C'!C23","v":109460966.7},{"$f":"'C3C'!D23","v":332024356},{"$f":"'C3C'!E23","v":384579410},{"$f":"'C3C'!F23","v":1891680.54},{"$f":"'C3C'!G23","v":266930834.34},{"$f":"'C3C'!H23","v":252887004},14043830.340000004,5.5534013681462269E-2,{"$f":"'C3C'!K23","v":384579410}]
[{"$f":"'Org structure'!A6","v":"Vote 05 - Community Services"},null,{"$f":"'C3C'!C30","v":2800356.61},{"$f":"'C3C'!D30","v":19485789},{"$f":"'C3C'!E30","v":21515533},{"$f":"'C3C'!F30","v":1743237.3399999999},{"$f":"'C3C'!G30","v":10685515.729999999},{"$f":"'C3C'!H30","v":13396471},-2710955.2700000014,-0.20236338883576141,{"$f":"'C3C'!K30","v":21515533}]
[{"$f":"'Org structure'!A7","v":"Vote 06 - Planning And Development"},null,{"$f":"'C3C'!C39","v":10602840.949999999},{"$f":"'C3C'!D39","v":38813052},{"$f":"'C3C'!E39","v":34110836},{"$f":"'C3C'!F39","v":2780116.5700000003},{"$f":"'C3C'!G39","v":22192001.529999997},{"$f":"'C3C'!H39","v":24934925},-2742923.4700000025,-0.11000327733089242,{"$f":"'C3C'!K39","v":34110836}]
[{"$f":"'Org structure'!A8","v":"Vote 07 - Infrastructure Development"},null,{"$f":"'C3C'!C48","v":24226129.210000001},{"$f":"'C3C'!D48","v":53720000},{"$f":"'C3C'!E48","v":69887541},{"$f":"'C3C'!F48","v":13810200.23},{"$f":"'C3C'!G48","v":80371658.939999998},{"$f":"'C3C'!H48","v":39046844},41324814.939999998,1.0583394381374329,{"$f":"'C3C'!K48","v":69887541}]
[{"$f":"'Org structure'!A9","v":"Vote 08 - "},null,{"$f":"'C3C'!C53","v":0},{"$f":"'C3C'!D53","v":0},{"$f":"'C3C'!E53","v":0},{"$f":"'C3C'!F53","v":0},{"$f":"'C3C'!G53","v":0},{"$f":"'C3C'!H53","v":0},{"$f":"G13-H13","v":0},{"$f":"IF(I13=0,\"\",I13/H13)","v":""},{"$f":"'C3C'!K53","v":0}]
[{"$f":"'Org structure'!A10","v":"Vote 09 - "},null,{"$f":"'C3C'!C54","v":0},{"$f":"'C3C'!D54","v":0},{"$f":"'C3C'!E54","v":0},{"$f":"'C3C'!F54","v":0},{"$f":"'C3C'!G54","v":0},{"$f":"'C3C'!H54","v":0},0,"",{"$f":"'C3C'!K54","v":0}]
[{"$f":"'Org structure'!A11","v":"Vote 10 - "},null,{"$f":"'C3C'!C55","v":0},{"$f":"'C3C'!D55","v":0},{"$f":"'C3C'!E55","v":0},{"$f":"'C3C'!F55","v":0},{"$f":"'C3C'!G55","v":0},{"$f":"'C3C'!H55","v":0},0,"",{"$f":"'C3C'!K55","v":0}]
[{"$f":"'Org structure'!A12","v":"Vote 11 - "},null,{"$f":"'C3C'!C56","v":0},{"$f":"'C3C'!D56","v":0},{"$f":"'C3C'!E56","v":0},{"$f":"'C3C'!F56","v":0},{"$f":"'C3C'!G56","v":0},{"$f":"'C3C'!H56","v":0},0,"",{"$f":"'C3C'!K56","v":0}]
[{"$f":"'Org structure'!A13","v":"Vote 12 - "},null,{"$f":"'C3C'!C57","v":0},{"$f":"'C3C'!D57","v":0},{"$f":"'C3C'!E57","v":0},{"$f":"'C3C'!F57","v":0},{"$f":"'C3C'!G57","v":0},{"$f":"'C3C'!H57","v":0},0,"",{"$f":"'C3C'!K57","v":0}]
[{"$f":"'Org structure'!A14","v":"Vote 13 - "},null,{"$f":"'C3C'!C58","v":0},{"$f":"'C3C'!D58","v":0},{"$f":"'C3C'!E58","v":0},{"$f":"'C3C'!F58","v":0},{"$f":"'C3C'!G58","v":0},{"$f":"'C3C'!H58","v":0},0,"",{"$f":"'C3C'!K58","v":0}]
[{"$f":"'Org structure'!A15","v":"Vote 14 - "},null,{"$f":"'C3C'!C59","v":0},{"$f":"'C3C'!D59","v":0},{"$f":"'C3C'!E59","v":0},{"$f":"'C3C'!F59","v":0},{"$f":"'C3C'!G59","v":0},{"$f":"'C3C'!H59","v":0},0,"",{"$f":"'C3C'!K59","v":0}]
[{"$f":"'Org structure'!A16","v":"Vote 15 - Other"},null,{"$f":"'C3C'!C60","v":0},{"$f":"'C3C'!D60","v":0},{"$f":"'C3C'!E60","v":0},{"$f":"'C3C'!F60","v":0},{"$f":"'C3C'!G60","v":0},{"$f":"'C3C'!H60","v":0},0,"",{"$f":"'C3C'!K60","v":0}]
["Total Revenue by Vote",2,{"$f":"SUM(C6:C20)","v":147130233.67000002},{"$f":"SUM(D6:D20)","v":444474127},510524250,20225930.34,380325064.47999996,330552532,49772532.479999997,0.15057374444797778,{"$f":"SUM(K6:K20)","v":510524250}]
[]
["Expenditure by Vote",1]
[{"$f":"'Org structure'!A2","v":"Vote 01 - Executive & Council"},null,{"$f":"'C3C'!C64","v":5878017.4299999997},{"$f":"'C3C'!D64","v":41370333},{"$f":"'C3C'!E64","v":36092103},{"$f":"'C3C'!F64","v":2756627.61},{"$f":"'C3C'!G64","v":26218099.639999997},{"$f":"'C3C'!H64","v":26688848},{"$f":"G24-H24","v":-470748.36000000313},{"$f":"IF(I24=0,\"\",I24/H24)","v":-1.7638391885629649E-2},{"$f":"'C3C'!K64","v":36092103}]
[{"$f":"'Org structure'!A3","v":"Vote 02 - Municipal Manager"},null,{"$f":"'C3C'!C67","v":3857393.6},{"$f":"'C3C'!D67","v":16630952},{"$f":"'C3C'!E67","v":19166217},{"$f":"'C3C'!F67","v":1851561.4700000002},{"$f":"'C3C'!G67","v":19469898.039999999},{"$f":"'C3C'!H67","v":12194379},7275519.0399999991,0.59662890910640054,{"$f":"'C3C'!K67","v":19166217}]
[{"$f":"'Org structure'!A4","v":"Vote 03 - Corporate Services"},null,{"$f":"'C3C'!C73","v":13061529.98},{"$f":"'C3C'!D73","v":68583673},{"$f":"'C3C'!E73","v":74827479},{"$f":"'C3C'!F73","v":3181555.95},{"$f":"'C3C'!G73","v":33129998.300000001},{"$f":"'C3C'!H73","v":48726626},-15596627.699999999,-0.32008429436505614,{"$f":"'C3C'!K73","v":74827479}]
[{"$f":"'Org structure'!A5","v":"Vote 04 - Budget And Treasury"},null,{"$f":"'C3C'!C81","v":5871963.7799999993},{"$f":"'C3C'!D81","v":56598436},{"$f":"'C3C'!E81","v":59354317},{"$f":"'C3C'!F81","v":1386408.9},{"$f":"'C3C'!G81","v":20835376.27},{"$f":"'C3C'!H81","v":38982357},-18146980.73,-0.46551779129209658,{"$f":"'C3C'!K81","v":59354317}]
[{"$f":"'Org structure'!A6","v":"Vote 05 - Community Services"},null,{"$f":"'C3C'!C88","v":9399975.620000001},{"$f":"'C3C'!D88","v":53508658},{"$f":"'C3C'!E88","v":59020805},{"$f":"'C3C'!F88","v":3421680.54},{"$f":"'C3C'!G88","v":27394469.969999999},{"$f":"'C3C'!H88","v":37928831},-10534361.030000001,-0.27774019795126303,{"$f":"'C3C'!K88","v":59020805}]
[{"$f":"'Org structure'!A7","v":"Vote 06 - Planning And Development"},null,{"$f":"'C3C'!C97","v":4544465.1100000003},{"$f":"'C3C'!D97","v":29506380},{"$f":"'C3C'!E97","v":24475826},{"$f":"'C3C'!F97","v":1209767.96},{"$f":"'C3C'!G97","v":6749980.0499999998},{"$f":"'C3C'!H97","v":18784834},-12034853.949999999,-0.64066863460172174,{"$f":"'C3C'!K97","v":24475826}]
[{"$f":"'Org structure'!A8","v":"Vote 07 - Infrastructure Development"},null,{"$f":"'C3C'!C106","v":4694479.0199999996},{"$f":"'C3C'!D106","v":43607445},{"$f":"'C3C'!E106","v":74501156},{"$f":"'C3C'!F106","v":2747490.64},{"$f":"'C3C'!G106","v":22183093.379999999},{"$f":"'C3C'!H106","v":41176163},-18993069.620000001,-0.46126370783989756,{"$f":"'C3C'!K106","v":74501156}]
[{"$f":"'Org structure'!A9","v":"Vote 08 - "},null,{"$f":"'C3C'!C111","v":0},{"$f":"'C3C'!D111","v":0},{"$f":"'C3C'!E111","v":0},{"$f":"'C3C'!F111","v":0},{"$f":"'C3C'!G111","v":0},{"$f":"'C3C'!H111","v":0},{"$f":"G31-H31","v":0},{"$f":"IF(I31=0,\"\",I31/H31)","v":""},{"$f":"'C3C'!K111","v":0}]
[{"$f":"'Org structure'!A10","v":"Vote 09 - "},null,{"$f":"'C3C'!C112","v":0},{"$f":"'C3C'!D112","v":0},{"$f":"'C3C'!E112","v":0},{"$f":"'C3C'!F112","v":0},{"$f":"'C3C'!G112","v":0},{"$f":"'C3C'!H112","v":0},0,"",{"$f":"'C3C'!K112","v":0}]
[{"$f":"'Org structure'!A11","v":"Vote 10 - "},null,{"$f":"'C3C'!C113","v":0},{"$f":"'C3C'!D113","v":0},{"$f":"'C3C'!E113","v":0},{"$f":"'C3C'!F113","v":0},{"$f":"'C3C'!G113","v":0},{"$f":"'C3C'!H113","v":0},0,{"$f":"IF(I33=0,\"\",I33/H33)","v":""},{"$f":"'C3C'!K113","v":0}]
[{"$f":"'Org structure'!A12","v":"Vote 11 - "},null,{"$f":"'C3C'!C114","v":0},{"$f":"'C3C'!D114","v":0},{"$f":"'C3C'!E114","v":0},{"$f":"'C3C'!F114","v":0},{"$f":"'C3C'!G114","v":0},{"$f":"'C3C'!H114","v":0},0,{"$f":"IF(I34=0,\"\",I34/H34)","v":""},{"$f":"'C3C'!K114","v":0}]
[{"$f":"'Org structure'!A13","v":"Vote 12 - "},null,{"$f":"'C3C'!C115","v":0},{"$f":"'C3C'!D115","v":0},{"$f":"'C3C'!E115","v":0},{"$f":"'C3C'!F115","v":0},{"$f":"'C3C'!G115","v":0},{"$f":"'C3C'!H115","v":0},0,{"$f":"IF(I35=0,\"\",I35/H35)","v":""},{"$f":"'C3C'!K115","v":0}]
[{"$f":"'Org structure'!A14","v":"Vote 13 - "},null,{"$f":"'C3C'!C116","v":0},{"$f":"'C3C'!D116","v":0},{"$f":"'C3C'!E116","v":0},{"$f":"'C3C'!F116","v":0},{"$f":"'C3C'!G116","v":0},{"$f":"'C3C'!H116","v":0},0,{"$f":"IF(I36=0,\"\",I36/H36)","v":""},{"$f":"'C3C'!K116","v":0}]
[{"$f":"'Org structure'!A15","v":"Vote 14 - "},null,{"$f":"'C3C'!C117","v":0},{"$f":"'C3C'!D117","v":0},{"$f":"'C3C'!E117","v":0},{"$f":"'C3C'!F117","v":0},{"$f":"'C3C'!G117","v":0},{"$f":"'C3C'!H117","v":0},0,{"$f":"IF(I37=0,\"\",I37/H37)","v":""},{"$f":"'C3C'!K117","v":0}]
[{"$f":"'Org structure'!A16","v":"Vote 15 - Other"},null,{"$f":"'C3C'!C118","v":0},{"$f":"'C3C'!D118","v":0},{"$f":"'C3C'!E118","v":0},{"$f":"'C3C'!F118","v":0},{"$f":"'C3C'!G118","v":0},{"$f":"'C3C'!H118","v":0},0,"",{"$f":"'C3C'!K118","v":0}]
["Total Expenditure by Vote",2,{"$f":"SUM(C24:C38)","v":47307824.539999992},{"$f":"SUM(D24:D38)","v":309805877},347437903,16555093.07,155980915.64999998,224482038,-68501122.350000009,{"$f":"IF(I39=0,\"\",I39/H39)","v":-0.30515190863511321},{"$f":"SUM(K24:K38)","v":347437903}]
[{"$f":"result","v":"Surplus/ (Deficit) for the year"},2,{"$f":"C21-C39","v":99822409.130000025},134668250,163086347,3670837.2699999996,224344148.82999998,106070494,{"$f":"I21-I39","v":118273654.83000001},{"$f":"IF(I40=0,\"\",I40/H40)","v":1.1150476477464131},{"$f":"K21-K39","v":163086347}]
[{"$f":"head27a","v":"References"}]
["1. Insert 'Vote'; e.g. Department, if different to standard classification structure"]
["2. Must reconcile to Monthly Budget Statement - Financial Performance Statement (standard classification)"]

{"sheet":"C3C","index":10,"n_rows":128,"n_cols":23,"rows_kept":128,"cut":false,"hidden":false,"merged":[[1,11,1,22],[1,3,1,10]]}
[{"$f":"muni& \" - \"&S71C& \" - \"&\"A\"& \" - \"&date","v":"LIM355 Lepelle-Nkumpi - Table C3 Monthly Budget Statement - Financial Performance (revenue and expenditure by municipal vote) - A - M08 February"}]
[{"$f":"Vdesc","v":"Vote Description"},{"$f":"head27","v":"Ref"},{"$f":"Head1","v":"2019/20"},{"$f":"Head2","v":"Budget Year 2020/21"},null,null,null,null,null,null,null,{"$f":"Head4","v":{"$error":"#REF!"}}]
["R thousand",null,{"$f":"Head5","v":"Audited Outcome"},{"$f":"Head6","v":"Original Budget"},{"$f":"Head7","v":"Adjusted Budget"},{"$f":"Head38","v":"Monthly actual"},{"$f":"Head39","v":"YearTD actual"},{"$f":"Head40","v":"YearTD budget"},{"$f":"Head41","v":"YTD variance"},{"$f":"Head41","v":"YTD variance"},{"$f":"Head8","v":"Full Year Forecast"},{"$f":"Head12","v":"Forecast 2010/11"},{"$f":"Head13","v":"Forecast 2011/12"},{"$f":"Head14","v":"Forecast 2012/13"},{"$f":"Head15","v":"Forecast 2013/14"},{"$f":"Head16","v":"Forecast 2014/15"},{"$f":"Head17","v":"Forecast 2015/16"},{"$f":"Head18","v":"Forecast 2016/17"},{"$f":"Head19","v":"Forecast 2017/18"},{"$f":"Head20","v":"Forecast 2018/19"},{"$f":"Head21","v":"Forecast 2019/20"},{"$f":"Head22","v":"Forecast 2020/21"},{"$f":"Head23","v":"Forecast 2021/22"}]
[null,null,null,null,null,null,null,null,null,"%"]
["Revenue by Vote",1]
[{"$f":"'Org structure'!A2","v":"Vote 01 - Executive & Council"},null,{"$f":"SUM(C7:C8)","v":0},0,0,0,0,0,{"$f":"G6-H6","v":0},{"$f":"IF(I6=0,\"\",I6/H6)","v":""},{"$f":"SUM(K7:K8)","v":0}]
[{"$f":"'Org structure'!E3","v":"01.1 - Mayor & Councillors"},null,0,0,0,0,0,0,{"$f":"G7-H7","v":0},{"$f":"IF(I7=0,\"\",I7/H7)","v":""},0]
[{"$f":"'Org structure'!E4","v":"01.2 - Mayor & Council Support"},null,0,0,0,0,0,0,{"$f":"G8-H8","v":0},{"$f":"IF(I8=0,\"\",I8/H8)","v":""},0]
[{"$f":"'Org structure'!A3","v":"Vote 02 - Municipal Manager"},null,{"$f":"SUM(C10:C14)","v":0},0,0,0,0,0,0,"",{"$f":"SUM(K10:K14)","v":0}]
[{"$f":"'Org structure'!E6","v":"02.1 - Municipal Manager"},null,0,0,0,0,0,0,{"$f":"G10-H10","v":0},{"$f":"IF(I10=0,\"\",I10/H10)","v":""},0]
[{"$f":"'Org structure'!E7","v":"02.2 - Municipal Manager Support"},null,0,0,0,0,0,0,{"$f":"G11-H11","v":0},{"$f":"IF(I11=0,\"\",I11/H11)","v":""},0]
[{"$f":"'Org structure'!E8","v":"02.3 - Internal Audit"},null,0,0,0,0,0,0,{"$f":"G12-H12","v":0},{"$f":"IF(I12=0,\"\",I12/H12)","v":""},0]
[{"$f":"'Org structure'!E9","v":"02.4 - Communications"},null,0,0,0,0,0,0,{"$f":"G13-H13","v":0},{"$f":"IF(I13=0,\"\",I13/H13)","v":""},0]
[{"$f":"'Org structure'!E10","v":"02.5 - Risk Management"},null,0,0,0,0,0,0,{"$f":"G14-H14","v":0},{"$f":"IF(I14=0,\"\",I14/H14)","v":""},0]
[{"$f":"'Org structure'!A4","v":"Vote 03 - Corporate Services"},null,{"$f":"SUM(C16:C22)","v":39940.199999999997},430930,430930,695.66,145053.94,287288,-142234.06,-0.49509224193144163,{"$f":"SUM(K16:K22)","v":430930}]
[{"$f":"'Org structure'!E12","v":"03.1 - Executive Manager: Corporate Services"},null,0,0,0,0,0,0,{"$f":"G16-H16","v":0},{"$f":"IF(I16=0,\"\",I16/H16)","v":""},0]
[{"$f":"'Org structure'!E13","v":"03.2 - Human Resource Management & Development"},null,0,221930,221930,0,62075,147952,-85877,-0.58043825024332218,221930]
[{"$f":"'Org structure'!E14","v":"03.3 - Information Technology"},null,39940.199999999997,209000,209000,695.66,82978.94,139336,-56357.06,-0.4044687661480163,209000]
[{"$f":"'Org structure'!E15","v":"03.4 - Legal Services"},null,0,0,0,0,0,0,0,"",0]
[{"$f":"'Org structure'!E16","v":"03.5 - Gen Adm_Sec_Fleet: General Administrat"},null,0,0,0,0,0,0,0,"",0]
[{"$f":"'Org structure'!E17","v":"03.6 - Gen Adm_Sec_Fleet: Security Services"},null,0,0,0,0,0,0,0,"",0]
[{"$f":"'Org structure'!E18","v":"03.7 - Gen Adm_Sec_Fleet: Fleet Management"},null,0,0,0,0,0,0,0,"",0]
[{"$f":"'Org structure'!A5","v":"Vote 04 - Budget And Treasury"},null,{"$f":"SUM(C24:C29)","v":109460966.7},332024356,384579410,1891680.54,266930834.34,252887004,14043830.340000004,5.5534013681462269E-2,{"$f":"SUM(K24:K29)","v":384579410}]
[{"$f":"'Org structure'!E20","v":"04.1 - Chief Financial Officer"},null,0,0,0,0,0,0,{"$f":"G24-H24","v":0},{"$f":"IF(I24=0,\"\",I24/H24)","v":""},0]
[{"$f":"'Org structure'!E21","v":"04.2 - Budget Planning & Management"},null,104662677.68000001,267947000,320513000,261285.27,253366805.38,210170936,43195869.379999995,0.20552732077093663,320513000]
[{"$f":"'Org structure'!E22","v":"04.3 - Expenditure Management"},null,0,0,0,0,1343769.55,0,1343769.55,{"$error":"#DIV/0!"},0]
[{"$f":"'Org structure'!E23","v":"04.4 - Revenue Management"},null,4671635.88,63660059,63649113,1630395.27,12215737.68,42437868,-30222130.32,-0.71215006182685714,63649113]
[{"$f":"'Org structure'!E24","v":"04.5 - Asset Management"},null,0,40531,40531,0,0,27024,-27024,-1,40531]
[{"$f":"'Org structure'!E25","v":"04.6 - Supply Chain Management"},null,126653.14,376766,376766,0,4521.7299999999996,251176,-246654.27,-0.98199776252508197,376766]
[{"$f":"'Org structure'!A6","v":"Vote 05 - Community Services"},null,{"$f":"SUM(C31:C38)","v":2800356.61},19485789,21515533,1743237.3399999999,10685515.729999999,13396471,-2710955.2700000014,-0.20236338883576141,{"$f":"SUM(K31:K38)","v":21515533}]
[{"$f":"'Org structure'!E27","v":"05.1 - Executive Manager: Community Services"},null,0,0,0,0,0,0,{"$f":"G31-H31","v":0},{"$f":"IF(I31=0,\"\",I31/H31)","v":""},0]
[{"$f":"'Org structure'!E28","v":"05.2 - Waste Management Services"},null,3116088.34,8187553,8455413,1129058.6100000001,5181212.0999999996,5511940,-330727.90000000037,-6.0002086379750207E-2,8455413]
[{"$f":"'Org structure'!E29","v":"05.3 - Road Traffic & Law Enforce: Traffic Serv"},null,-1352688.84,2604693,4091600,11015,673474.01,2033846,-1360371.99,-0.6688667627735827,4091600]
[{"$f":"'Org structure'!E30","v":"05.4 - Road Traffic&Law Enforce: Licencing Serv"},null,963757.07,8430450,8428108,599146.35,4666107.8600000003,5619828,-953720.13999999966,-0.16970628638456545,8428108]
[{"$f":"'Org structure'!E31","v":"05.5 - Road Traffic&Law Enforce: Pound"},null,15721.73,28403,2000,0,1052.17,13656,-12603.83,-0.92295181605155241,2000]
[{"$f":"'Org structure'!E32","v":"05.6 - Institutional & Social Dev Management"},null,16260.95,99001,201277,4017.38,145869.26,86455,59414.260000000009,0.68722757503903775,201277]
[{"$f":"'Org structure'!E33","v":"05.7 - Libraries And Archives"},null,0,4397,1000,0,0,2249,-2249,-1,1000]
[{"$f":"'Org structure'!E34","v":"05.8 - Community Halls And Facilities"},null,41217.360000000001,131292,336135,0,17800.330000000002,128497,-110696.67,-0.8614727970302809,336135]
[{"$f":"'Org structure'!A7","v":"Vote 06 - Planning And Development"},null,{"$f":"SUM(C40:C47)","v":10602840.949999999},38813052,34110836,2780116.5700000003,22192001.529999997,24934925,-2742923.4700000025,-0.11000327733089242,{"$f":"SUM(K40:K47)","v":34110836}]
[{"$f":"'Org structure'!E36","v":"06.1 - Executive Manager:Planning & Development"},null,0,0,0,0,0,0,{"$f":"G40-H40","v":0},{"$f":"IF(I40=0,\"\",I40/H40)","v":""},0]
[{"$f":"'Org structure'!E37","v":"06.2 - Economic Development & Planning"},null,916808.3,70324,4347,0,13.04,33686,-33672.959999999999,-0.99961289556492305,4347]
[{"$f":"'Org structure'!E38","v":"06.3 - Development & Town Planning"},null,1213214,6742538,1812536,150426.68,1085660.02,3509039,-2423378.98,-0.69061044348609402,1812536]
[{"$f":"'Org structure'!E39","v":"06.4 - Property Management & Housing"},null,8472818.6500000004,32000190,31900190,2629689.89,21106328.469999999,21313448,-207119.53000000119,-9.7177861601746088E-3,31900190]
[{"$f":"'Org structure'!E40","v":"06.5 - Integrated Development Planning"},null,0,0,377308,0,0,75461,-75461,-1,377308]
[{"$f":"'Org structure'!E41","v":"06.6 - Performance Management"},null,0,0,0,0,0,0,0,"",0]
[{"$f":"'Org structure'!E42","v":"06.7 - Environmental Management Services"},null,0,0,16455,0,0,3291,-3291,-1,16455]
[{"$f":"'Org structure'!E43","v":"06.8 - Disaster Management"},null,0,0,0,0,0,0,0,"",0]
[{"$f":"'Org structure'!A8","v":"Vote 07 - Infrastructure Development"},null,{"$f":"SUM(C49:C52)","v":24226129.210000001},53720000,69887541,13810200.23,80371658.939999998,39046844,{"$f":"G48-H48","v":41324814.939999998},{"$f":"IF(I48=0,\"\",I48/H48)","v":1.0583394381374329},{"$f":"SUM(K49:K52)","v":69887541}]
[{"$f":"'Org structure'!E45","v":"07.1 - Executive Manager: Infrastructure Dev"},null,0,0,0,0,0,0,{"$f":"G49-H49","v":0},{"$f":"IF(I49=0,\"\",I49/H49)","v":""},0]
[{"$f":"'Org structure'!E46","v":"07.2 - Road Construction & Maintenance"},null,20242401.48,0,0,8309836.6399999997,68029866.909999996,0,{"$f":"G50-H50","v":68029866.909999996},{"$f":"IF(I50=0,\"\",I50/H50)","v":{"$error":"#DIV/0!"}},0]
[{"$f":"'Org structure'!E47","v":"07.3 - Electrical & Mechanical Works"},null,0,0,0,0,0,0,{"$f":"G51-H51","v":0},{"$f":"IF(I51=0,\"\",I51/H51)","v":""},0]
[{"$f":"'Org structure'!E48","v":"07.4 - Project Management"},null,3983727.73,53720000,69887541,5500363.5899999999,12341792.029999999,39046844,{"$f":"G52-H52","v":-26705051.969999999},{"$f":"IF(I52=0,\"\",I52/H52)","v":-0.68392344257067228},69887541]
[{"$f":"'Org structure'!A9","v":"Vote 08 - "},null,0,0,0,0,0,0,0,"",0]
[{"$f":"'Org structure'!A10","v":"Vote 09 - "},null,0,0,0,0,0,0,0,"",0]
[{"$f":"'Org structure'!A11","v":"Vote 10 - "},null,0,0,0,0,0,0,0,"",0]
[{"$f":"'Org structure'!A12","v":"Vote 11 - "},null,0,0,0,0,0,0,0,"",0]
[{"$f":"'Org structure'!A13","v":"Vote 12 - "},null,0,0,0,0,0,0,0,"",0]
[{"$f":"'Org structure'!A14","v":"Vote 13 - "},null,0,0,0,0,0,0,{"$f":"G58-H58","v":0},{"$f":"IF(I58=0,\"\",I58/H58)","v":""},0]
[{"$f":"'Org structure'!A15","v":"Vote 14 - "},null,0,0,0,0,0,0,0,"",0]
[{"$f":"'Org structure'!A16","v":"Vote 15 - Other"},null,0,0,0,0,0,0,0,"",0]
["Total Revenue by Vote",2,{"$f":"C6+C9+C15+C23+C30+C39+C48+C53+C54+C55+C56+C57+C58+C59+C60","v":147130233.67000002},444474127,510524250,20225930.34,380325064.47999996,330552532,49772532.479999959,0.15057374444797766,{"$f":"K6+K9+K15+K23+K30+K39+K48+K53+K54+K55+K56+K57+K58+K59+K60","v":510524250}]
[null,null,null,null,null,null,null,null,0,""]
["Expenditure by Vote",1,null,null,null,null,null,null,0,""]
[{"$f":"'Org structure'!A2","v":"Vote 01 - Executive & Council"},null,{"$f":"SUM(C65:C66)","v":5878017.4299999997},41370333,36092103,2756627.61,26218099.639999997,26688848,-470748.36000000313,-1.7638391885629649E-2,{"$f":"SUM(K65:K66)","v":36092103}]
[{"$f":"'Org structure'!E3","v":"01.1 - Mayor & Councillors"},null,3744580.79,31605649,31380933,3218458.01,18431901.079999998,21025500,{"$f":"G65-H65","v":-2593598.9200000018},{"$f":"IF(I65=0,\"\",I65/H65)","v":-0.12335492235618661},31380933]
[{"$f":"'Org structure'!E4","v":"01.2 - Mayor & Council Support"},null,2133436.64,9764684,4711170,-461830.40000000002,7786198.5599999996,5663348,{"$f":"G66-H66","v":2122850.5599999996},{"$f":"IF(I66=0,\"\",I66/H66)","v":0.37484021112599819},4711170]
[{"$f":"'Org structure'!A3","v":"Vote 02 - Municipal Manager"},null,{"$f":"SUM(C68:C72)","v":3857393.6},16630952,19166217,1851561.4700000002,19469898.039999999,12194379,7275519.0399999991,0.59662890910640054,{"$f":"SUM(K68:K72)","v":19166217}]
[{"$f":"'Org structure'!E6","v":"02.1 - Municipal Manager"},null,28211.22,1459263,384383,2000,164426.32,757864,{"$f":"G68-H68","v":-593437.67999999993},{"$f":"IF(I68=0,\"\",I68/H68)","v":-0.78303980661437933},384383]
[{"$f":"'Org structure'!E7","v":"02.2 - Municipal Manager Support"},null,821739.78,2055543,2073061,129352.77,4754174.34,1373872,{"$f":"G69-H69","v":3380302.34},{"$f":"IF(I69=0,\"\",I69/H69)","v":2.4604201410320612},2073061]
[{"$f":"'Org structure'!E8","v":"02.3 - Internal Audit"},null,1656440.59,8129247,8637345,519220.24,1132452.44,5521140,{"$f":"G70-H70","v":-4388687.5600000005},{"$f":"IF(I70=0,\"\",I70/H70)","v":-0.79488793256465162},8637345]
[{"$f":"'Org structure'!E9","v":"02.4 - Communications"},null,1000010.49,2023274,3693842,114189.87,10598643.9,1682958,{"$f":"G71-H71","v":8915685.9000000004},{"$f":"IF(I71=0,\"\",I71/H71)","v":5.2976282830587573},3693842]
[{"$f":"'Org structure'!E10","v":"02.5 - Risk Management"},null,350991.52,2963625,4377586,1086798.5900000001,2820201.04,2858545,{"$f":"G72-H72","v":-38343.959999999963},{"$f":"IF(I72=0,\"\",I72/H72)","v":-1.3413803176091321E-2},4377586]
[{"$f":"'Org structure'!A4","v":"Vote 03 - Corporate Services"},null,{"$f":"SUM(C74:C80)","v":13061529.98},68583673,74827479,3181555.95,33129998.300000001,48726626,-15596627.699999999,-0.32008429436505614,{"$f":"SUM(K74:K80)","v":74827479}]
[{"$f":"'Org structure'!E12","v":"03.1 - Executive Manager: Corporate Services"},null,0,1195502,1195502,91732.5,91732.5,797000,{"$f":"G74-H74","v":-705267.5},{"$f":"IF(I74=0,\"\",I74/H74)","v":-0.88490276035131743},1195502]
[{"$f":"'Org structure'!E13","v":"03.2 - Human Resource Management & Development"},null,2073196.74,8864309,9181262,340657.45,5358078.47,6400656,-1042577.5300000003,-0.16288604324306763,9181262]
[{"$f":"'Org structure'!E14","v":"03.3 - Information Technology"},null,1063297.72,7851479,6041293,250613.13,2517805.2599999998,4860850,-2343044.7400000002,-0.48202366664266544,6041293]
[{"$f":"'Org structure'!E15","v":"03.4 - Legal Services"},null,1366637.65,6150372,12129478,311914.52,7010714.21,6107504,903210.21,0.1478853243485391,12129478]
[{"$f":"'Org structure'!E16","v":"03.5 - Gen Adm_Sec_Fleet: General Administrat"},null,7962892.9400000004,39486806,32825151,1712567.46,15678830.26,25519901,-9841070.7400000002,-0.38562339015343361,32825151]
[{"$f":"'Org structure'!E17","v":"03.6 - Gen Adm_Sec_Fleet: Security Services"},null,0,0,207970,0,0,41592,-41592,-1,207970]
[{"$f":"'Org structure'!E18","v":"03.7 - Gen Adm_Sec_Fleet: Fleet Management"},null,595504.93000000005,5035205,13246823,474070.89,2472837.6,4999123,-2526285.4,-0.50534571763887381,13246823]
[{"$f":"'Org structure'!A5","v":"Vote 04 - Budget And Treasury"},null,{"$f":"SUM(C82:C87)","v":5871963.7799999993},56598436,59354317,1386408.9,20835376.27,38982357,{"$f":"G81-H81","v":-18146980.73},{"$f":"IF(I81=0,\"\",I81/H81)","v":-0.46551779129209658},{"$f":"SUM(K82:K87)","v":59354317}]
[{"$f":"'Org structure'!E20","v":"04.1 - Chief Financial Officer"},null,0,1203256,535560,89185.5,174371,668629,{"$f":"G82-H82","v":-494258},{"$f":"IF(I82=0,\"\",I82/H82)","v":-0.73921113203286126},535560]
[{"$f":"'Org structure'!E21","v":"04.2 - Budget Planning & Management"},null,1366256.25,12369797,16238230,250747.81,14708920.15,9222503,5486417.1500000004,0.59489459098034458,16238230]
[{"$f":"'Org structure'!E22","v":"04.3 - Expenditure Management"},null,999064.07,3770759,3753585,294018.09000000003,1421749.31,2510414,-1088664.69,-0.43365942430212706,3753585]
[{"$f":"'Org structure'!E23","v":"04.4 - Revenue Management"},null,1414346.93,28083234,27953477,500199.48,666310.21,18898449,-18232138.789999999,-0.96474259818887775,27953477]
[{"$f":"'Org structure'!E24","v":"04.5 - Asset Management"},null,1492531.8,7487183,7275584,218663.96,3830191.54,4949129,-1118937.46,-0.22608775402702172,7275584]
[{"$f":"'Org structure'!E25","v":"04.6 - Supply Chain Management"},null,599764.73,3684207,3597881,33594.06,33834.06,2733233,-2699398.94,-0.98762123097445409,3597881]
[{"$f":"'Org structure'!A6","v":"Vote 05 - Community Services"},null,{"$f":"SUM(C89:C96)","v":9399975.620000001},53508658,59020805,3421680.54,27394469.969999999,37928831,-10534361.030000001,-0.27774019795126303,{"$f":"SUM(K89:K96)","v":59020805}]
[{"$f":"'Org structure'!E27","v":"05.1 - Executive Manager: Community Services"},null,0,1208042,1195502,76537.25,76537.25,802852,{"$f":"G89-H89","v":-726314.75},{"$f":"IF(I89=0,\"\",I89/H89)","v":-0.90466829502822443},1195502]
[{"$f":"'Org structure'!E28","v":"05.2 - Waste Management Services"},null,2815846.64,18143063,20624455,1193743.49,20015362.489999998,13424654,6590708.4899999984,0.49094065962519395,20624455]
[{"$f":"'Org structure'!E29","v":"05.3 - Road Traffic & Law Enforce: Traffic Serv"},null,2021983.83,10813045,13427354,713508.79,806033.87,8002196,-7196162.1299999999,-0.89927341569739105,13427354]
[{"$f":"'Org structure'!E30","v":"05.4 - Road Traffic&Law Enforce: Licencing Serv"},null,2270181.16,8368309,8247217,573700.49,751071.04,5554663,-4803591.96,-0.86478548923670073,8247217]
[{"$f":"'Org structure'!E31","v":"05.5 - Road Traffic&Law Enforce: Pound"},null,219694.96,758387,660160,48732.959999999999,48732.959999999999,485947,-437214.04,-0.89971548337575902,660160]
[{"$f":"'Org structure'!E32","v":"05.6 - Institutional & Social Dev Management"},null,1413184.21,4374664,2955154,58406.11,58406.11,2682860,-2624453.89,-0.97822990763588114,2955154]
[{"$f":"'Org structure'!E33","v":"05.7 - Libraries And Archives"},null,146463.26999999999,1227349,1192349,68871.89,550975.12,811224,-260248.88,-0.32081013382247076,1192349]
[{"$f":"'Org structure'!E34","v":"05.8 - Community Halls And Facilities"},null,512621.55,8615799,10718614,688179.56,5087351.13,6164435,-1077083.8700000001,-0.17472548092404253,10718614]
[{"$f":"'Org structure'!A7","v":"Vote 06 - Planning And Development"},null,{"$f":"SUM(C98:C105)","v":4544465.1100000003},29506380,24475826,1209767.96,6749980.0499999998,18784834,-12034853.949999999,-0.64066863460172174,{"$f":"SUM(K98:K105)","v":24475826}]
[{"$f":"'Org structure'!E36","v":"06.1 - Executive Manager:Planning & Development"},null,0,1195502,298876,0,0,617675,{"$f":"G98-H98","v":-617675},{"$f":"IF(I98=0,\"\",I98/H98)","v":-1},298876]
[{"$f":"'Org structure'!E37","v":"06.2 - Economic Development & Planning"},null,566638.86,2783408,2438883,181598.7,2116347.98,1786713,329634.98,0.18449240588723537,2438883]
[{"$f":"'Org structure'!E38","v":"06.3 - Development & Town Planning"},null,645192.98,3869570,4596393,249519.84,249519.84,2725083,-2475563.16,-0.90843587516416935,4596393]
[{"$f":"'Org structure'!E39","v":"06.4 - Property Management & Housing"},null,2025425.08,15465860,11417490,407779.49,3659446.5,9500902,-5841455.5,-0.61483167598192257,11417490]
[{"$f":"'Org structure'!E40","v":"06.5 - Integrated Development Planning"},null,479618.25,2927913,2608995,155915.59,329511.59000000003,1888162,-1558650.41,-0.82548553037292349,2608995]
[{"$f":"'Org structure'!E41","v":"06.6 - Performance Management"},null,293100.06,1436648,1345837,99763.45,99763.45,939606,-839842.55,-0.89382416672520193,1345837]
[{"$f":"'Org structure'!E42","v":"06.7 - Environmental Management Services"},null,241563.27,1078518,716137,44492.97,76892.97,646539,-569646.03,-0.88106986585496005,716137]
[{"$f":"'Org structure'!E43","v":"06.8 - Disaster Management"},null,292926.61,748961,1053215,70697.919999999998,218497.72,680154,-461656.28,-0.67875257662235322,1053215]
[{"$f":"'Org structure'!A8","v":"Vote 07 - Infrastructure Development"},null,{"$f":"SUM(C107:C110)","v":4694479.0199999996},43607445,74501156,2747490.64,22183093.379999999,41176163,-18993069.620000001,-0.46126370783989756,{"$f":"SUM(K107:K110)","v":74501156}]
[{"$f":"'Org structure'!E45","v":"07.1 - Executive Manager: Infrastructure Dev"},null,0,1222271,1210271,0,0,812448,{"$f":"G107-H107","v":-812448},{"$f":"IF(I107=0,\"\",I107/H107)","v":-1},1210271]
[{"$f":"'Org structure'!E46","v":"07.2 - Road Construction & Maintenance"},null,2808169.95,19649580,30221837,1464204.87,13815836.93,16781299,{"$f":"G108-H108","v":-2965462.0700000003},{"$f":"IF(I108=0,\"\",I108/H108)","v":-0.17671230755139994},30221837]
[{"$f":"'Org structure'!E47","v":"07.3 - Electrical & Mechanical Works"},null,1860752.06,20083844,40829581,1098394.04,7083709.5700000003,21897040,{"$f":"G109-H109","v":-14813330.43},{"$f":"IF(I109=0,\"\",I109/H109)","v":-0.676499217702484},40829581]
[{"$f":"'Org structure'!E48","v":"07.4 - Project Management"},null,25557.01,2651750,2239467,184891.73,1283546.8799999999,1685376,{"$f":"G110-H110","v":-401829.12000000011},{"$f":"IF(I110=0,\"\",I110/H110)","v":-0.23842105263157901},2239467]
[{"$f":"'Org structure'!A9","v":"Vote 08 - "},null,0,0,0,0,0,0,0,"",0]
[{"$f":"'Org structure'!A10","v":"Vote 09 - "},null,0,0,0,0,0,0,{"$f":"G112-H112","v":0},{"$f":"IF(I112=0,\"\",I112/H112)","v":""},0]
[{"$f":"'Org structure'!A11","v":"Vote 10 - "},null,0,0,0,0,0,0,0,"",0]
[{"$f":"'Org structure'!A12","v":"Vote 11 - "},null,0,0,0,0,0,0,0,"",0]
[{"$f":"'Org structure'!A13","v":"Vote 12 - "},null,0,0,0,0,0,0,0,"",0]
[{"$f":"'Org structure'!A14","v":"Vote 13 - "},null,0,0,0,0,0,0,0,"",0]
[{"$f":"'Org structure'!A15","v":"Vote 14 - "},null,0,0,0,0,0,0,0,"",0]
[{"$f":"'Org structure'!A16","v":"Vote 15 - Other"},null,0,0,0,0,0,0,{"$f":"G118-H118","v":0},{"$f":"IF(I118=0,\"\",I118/H118)","v":""},0]
["Total Expenditure by Vote",2,{"$f":"C64+C67+C73+C81+C88+C97+C106+C111+C112+C113+C114+C115+C116+C117+C118","v":47307824.539999992},309805877,347437903,16555093.07,155980915.64999998,224482038,-68501122.350000024,-0.30515190863511327,{"$f":"K64+K67+K73+K81+K88+K97+K106+K111+K112+K113+K114+K115+K116+K117+K118","v":347437903}]
[null,null,null,null,null,null,null,null,0,"",null,{"$f":"#REF!-#REF!","v":{"$error":"#REF!"}},{"$f":"#REF!-#REF!","v":{"$error":"#REF!"}},{"$f":"#REF!-#REF!","v":{"$error":"#REF!"}},{"$f":"#REF!-#REF!","v":{"$error":"#REF!"}},{"$f":"#REF!-#REF!","v":{"$error":"#REF!"}},{"$f":"#REF!-#REF!","v":{"$error":"#REF!"}},{"$f":"#REF!-#REF!","v":{"$error":"#REF!"}},{"$f":"#REF!-#REF!","v":{"$error":"#REF!"}},{"$f":"#REF!-#REF!","v":{"$error":"#REF!"}},{"$f":"#REF!-#REF!","v":{"$error":"#REF!"}},{"$f":"#REF!-#REF!","v":{"$error":"#REF!"}},{"$f":"#REF!-#REF!","v":{"$error":"#REF!"}}]
[{"$f":"result","v":"Surplus/ (Deficit) for the year"},2,{"$f":"C61-C119","v":99822409.130000025},134668250,163086347,3670837.2699999996,224344148.82999998,106070494,118273654.82999998,1.1150476477464126,{"$f":"K61-K119","v":163086347}]
[{"$f":"head27a","v":"References"}]
["1. Insert 'Vote'; e.g. Department, if different to standard structure"]
["2. Must reconcile to Financial Performance ('Revenue and Expenditure by Standard Classification' and 'Revenue and Expenditure')"]
["3. Assign share in 'associate' to relevant Vote"]
[]
["check revenue"]
["check expenditure"]

{"sheet":"C4-FinPerf RE","index":11,"n_rows":53,"n_cols":11,"rows_kept":53,"cut":false,"hidden":false,"merged":[[1,0,2,0],[1,1,2,1],[1,3,1,10],[0,0,0,10]]}
[{"$f":"muni& \" - \"&S71B& \" - \"&date","v":"LIM355 Lepelle-Nkumpi - Table C4 Monthly Budget Statement - Financial Performance (revenue and expenditure) - M08 February"}]
[{"$f":"desc","v":"Description"},{"$f":"head27","v":"Ref"},{"$f":"Head1","v":"2019/20"},{"$f":"Head2","v":"Budget Year 2020/21"}]
[null,null,{"$f":"Head5","v":"Audited Outcome"},{"$f":"Head6","v":"Original Budget"},{"$f":"Head7","v":"Adjusted Budget"},{"$f":"Head38","v":"Monthly actual"},{"$f":"Head39","v":"YearTD actual"},{"$f":"Head40","v":"YearTD budget"},{"$f":"Head41","v":"YTD variance"},{"$f":"Head41","v":"YTD variance"},{"$f":"Head8","v":"Full Year Forecast"}]
["R thousands",null,null,null,null,null,null,null,null,"%"]
["Revenue By Source"]
["Property rates",null,8369863.7699999996,31568339,31568339,2616808.89,20934180.620000001,21045544,{"$f":"G6-H6","v":-111363.37999999896},{"$f":"IF(I6=0,\"\",I6/H6)","v":-5.2915420005298485E-3},31568339]
["Service charges - electricity revenue",null,null,null,null,null,null,null,0,""]
["Service charges - water revenue",null,16512163.869999999,0,0,4836999.2,41450977.640000001,0,41450977.640000001,{"$error":"#DIV/0!"},0]
["Service charges - sanitation revenue",null,3730237.61,0,0,716692.3,5734093.21,0,5734093.21,{"$error":"#DIV/0!"},0]
["Service charges - refuse revenue",null,2823088.34,6271577,6539437,539168.61,4322822.0999999996,4234620,88202.099999999627,2.0828811085764395E-2,6539437]
[]
["Rental of facilities and equipment",null,129468.43,500845,292308,695.66,119162.57,292197,-173034.43,-0.59218414288989962,292308]
["Interest earned - external investments",null,1202955.6399999999,7505491,7505491,198622.24,1141689.27,5003664,-3861974.73,-0.77182934945272108,7505491]
["Interest earned - outstanding debtors",null,0,12032957,12032957,4175835.38,31707269.050000001,8021976,23685293.050000001,2.9525509737251769,12032957]
["Dividends received",null,0,0,0,0,0,0,0,"",0]
["Fines, penalties and forfeits",null,-1336967.1100000001,2626549,4100146,11015,674526.18,2045760,-1371233.8199999998,-0.67028088338808067,4100146]
["Licences and permits",null,262.04000000000002,11324,1500,0,605.04,5580,-4974.96,-0.89156989247311824,1500]
["Agency services",null,4455847.8899999997,17437256,17437256,599146.35,4665515.8600000003,11624832,-6959316.1399999997,-0.59865950234807697,17437256]
["Transfers and subsidies",null,105855612.68000001,269853000,323118898,851175.27,254225195.38,211581579,42643616.379999995,0.20154692379907041,323118898]
["Other revenue",null,1403972.78,42946789,38040377,179407.85,1663465.98,27649936,-25986470.02,-0.93983834248296272,38040377]
["Gains",null,0,0,0,0,1343769.55,0,1343769.55,{"$error":"#DIV/0!"},0]
["Total Revenue (excluding capital transfers and contributions)",null,{"$f":"SUM(C6:C10)+SUM(C12:C21)","v":143146505.94},390754127,440636709,14725566.75,367983272.45000005,291505688,76477584.450000048,0.26235366100300606,{"$f":"SUM(K6:K10)+SUM(K12:K21)","v":440636709}]
[]
["Expenditure By Type"]
["Employee related costs",null,25927135.449999999,117854345,113807212,7986009.1900000004,64747073.219999999,80052485,{"$f":"G25-H25","v":-15305411.780000001},{"$f":"IF(I25=0,\"\",I25/H25)","v":-0.19119221320862184},113807212]
["Remuneration of councillors",null,3605569.71,23639490,23639472,1872613.37,15141785.039999999,15759653,-617867.96000000089,-3.9205683018528448E-2,23639472]
["Debt impairment",null,1874168.48,29757430,31257430,111627.4,137894.85,20138288,-20000393.149999999,-0.99315260314084286,31257430]
["Depreciation & asset impairment",null,13577.88,32261244,32261244,2447456.92,19577822.149999999,21507488,-1929665.8500000015,-8.9720652174721735E-2,32261244]
["Finance charges",null,0,141075,141075,0,0,94048,-94048,-1,141075]
["Bulk purchases",null,null,null,null,null,null,null,0,""]
["Other materials",null,1214498,3765094,4926250,7264.14,329251.01,3082296,-2753044.99,-0.89317995091970404,4926250]
["Contracted services",null,8752569.0299999993,59001829,95790192,1434291.81,28544302.899999999,53401867,-24857564.100000001,-0.46548118064860916,95790192]
["Transfers and subsidies",null,null,null,null,null,null,null,0,""]
["Other expenditure",null,5920305.9900000002,43385370,45615028,2695830.24,26653971.949999999,30445913,-3791941.0500000007,-0.1245468004194849,45615028]
["Losses",null,0,0,0,0,848814.53,0,848814.53,{"$error":"#DIV/0!"},0]
["Total Expenditure",null,{"$f":"SUM(C25:C35)","v":47307824.539999999},{"$f":"SUM(D25:D35)","v":309805877},{"$f":"SUM(E25:E35)","v":347437903},16555093.070000002,155980915.64999998,224482038,-68501122.350000024,-0.30515190863511327,347437903]
[]
["Surplus/(Deficit)",null,{"$f":"C22-C36","v":95838681.400000006},80948250,93198806,-1829526.3200000022,212002356.80000007,67023650,{"$f":"I22-I36","v":144978706.80000007},2.1630977543001624,{"$f":"K22-K36","v":93198806}]
["Transfers and subsidies - capital (monetary allocations) (National / Provincial and District)",null,3983727.73,53720000,69887541,5500363.5899999999,12341792.029999999,39046844,{"$f":"G39-H39","v":-26705051.969999999},-0.68392344257067228,69887541]
["Transfers and subsidies - capital (monetary allocations) (National / Provincial Departmental Agencies, Households, Non-profit Institutions, Private Enterprises, Public Corporatons, Higher Educational Institutions)",null,null,null,null,null,null,null,{"$f":"G40-H40","v":0},""]
["Transfers and subsidies - capital (in-kind - all) ",null,null,null,null,null,null,null,{"$f":"G41-H41","v":0},""]
["Surplus/(Deficit) after capital transfers & contributions",null,{"$f":"C38+SUM(C39:C41)","v":99822409.13000001},134668250,163086347,3670837.2699999977,224344148.83000007,106070494,null,null,{"$f":"K38+SUM(K39:K41)","v":163086347}]
["Taxation",null,null,null,null,null,null,null,{"$f":"G43-H43","v":0},{"$f":"IF(I43=0,\"\",I43/H43)","v":""}]
["Surplus/(Deficit) after taxation",null,{"$f":"C42-C43","v":99822409.13000001},134668250,163086347,3670837.2699999977,224344148.83000007,106070494,null,null,{"$f":"K42-K43","v":163086347}]
["Attributable to minorities"]
["Surplus/(Deficit) attributable to municipality",null,{"$f":"SUM(C44:C45)","v":99822409.13000001},134668250,163086347,3670837.2699999977,224344148.83000007,106070494,null,null,{"$f":"SUM(K44:K45)","v":163086347}]
["Share of surplus/ (deficit) of associate"]
["Surplus/ (Deficit) for the year",null,{"$f":"C46+C47","v":99822409.13000001},134668250,163086347,3670837.2699999977,224344148.83000007,106070494,null,null,{"$f":"K46+K47","v":163086347}]
[{"$f":"head27a","v":"References"}]
["1. Material variances to be explained on Table SC1"]
[]
[]
[{"$f":"A22&\" including capital transfers/contributions etc\"","v":"Total Revenue (excluding capital transfers and contributions) including capital transfers/contributions etc"},null,{"$f":"C22+SUM(C39:C41)","v":147130233.66999999},444474127,510524250,20225930.34,380325064.48000002,330552532,null,null,{"$f":"K22+SUM(K39:K41)","v":510524250}]

{"sheet":"C5-Capex","index":12,"n_rows":86,"n_cols":11,"rows_kept":86,"cut":false,"hidden":false,"merged":[[0,0,0,10],[76,0,76,10],[78,0,78,10],[77,0,77,10],[1,0,2,0],[1,1,2,1]]}
[{"$f":"muni& \" - \"&S71D& \" - \"&date","v":"LIM355 Lepelle-Nkumpi - Table C5 Monthly Budget Statement - Capital Expenditure (municipal vote, functional classification and funding) - M08 February"}]
[{"$f":"Vdesc","v":"Vote Description"},{"$f":"head27","v":"Ref"},{"$f":"Head1","v":"2019/20"},{"$f":"Head2","v":"Budget Year 2020/21"}]
[null,null,{"$f":"Head5","v":"Audited Outcome"},{"$f":"Head6","v":"Original Budget"},{"$f":"Head7","v":"Adjusted Budget"},{"$f":"Head38","v":"Monthly actual"},{"$f":"Head39","v":"YearTD actual"},{"$f":"Head40","v":"YearTD budget"},{"$f":"Head41","v":"YTD variance"},{"$f":"Head41","v":"YTD variance"},{"$f":"Head8","v":"Full Year Forecast"}]
["R thousands",1,null,null,null,null,null,null,null,"%"]
["Multi-Year expenditure appropriation",2]
[{"$f":"'Org structure'!A2","v":"Vote 01 - Executive & Council"},null,{"$f":"'C5C'!C7","v":0},{"$f":"'C5C'!D7","v":0},{"$f":"'C5C'!E7","v":0},{"$f":"'C5C'!F7","v":0},{"$f":"'C5C'!G7","v":0},{"$f":"'C5C'!H7","v":0},{"$f":"G6-H6","v":0},{"$f":"IF(I6=0,\"\",I6/H6)","v":""},{"$f":"'C5C'!K7","v":0}]
[{"$f":"'Org structure'!A3","v":"Vote 02 - Municipal Manager"},null,{"$f":"'C5C'!C10","v":0},{"$f":"'C5C'!D10","v":0},{"$f":"'C5C'!E10","v":0},{"$f":"'C5C'!F10","v":0},{"$f":"'C5C'!G10","v":0},{"$f":"'C5C'!H10","v":0},0,"",{"$f":"'C5C'!K10","v":0}]
[{"$f":"'Org structure'!A4","v":"Vote 03 - Corporate Services"},null,{"$f":"'C5C'!C16","v":0},{"$f":"'C5C'!D16","v":0},{"$f":"'C5C'!E16","v":0},{"$f":"'C5C'!F16","v":0},{"$f":"'C5C'!G16","v":0},{"$f":"'C5C'!H16","v":0},0,"",{"$f":"'C5C'!K16","v":0}]
[{"$f":"'Org structure'!A5","v":"Vote 04 - Budget And Treasury"},null,{"$f":"'C5C'!C24","v":0},{"$f":"'C5C'!D24","v":0},{"$f":"'C5C'!E24","v":0},{"$f":"'C5C'!F24","v":0},{"$f":"'C5C'!G24","v":0},{"$f":"'C5C'!H24","v":0},0,"",{"$f":"'C5C'!K24","v":0}]
[{"$f":"'Org structure'!A6","v":"Vote 05 - Community Services"},null,{"$f":"'C5C'!C31","v":0},{"$f":"'C5C'!D31","v":0},{"$f":"'C5C'!E31","v":0},{"$f":"'C5C'!F31","v":0},{"$f":"'C5C'!G31","v":0},{"$f":"'C5C'!H31","v":0},0,"",{"$f":"'C5C'!K31","v":0}]
[{"$f":"'Org structure'!A7","v":"Vote 06 - Planning And Development"},null,{"$f":"'C5C'!C40","v":0},{"$f":"'C5C'!D40","v":0},{"$f":"'C5C'!E40","v":0},{"$f":"'C5C'!F40","v":0},{"$f":"'C5C'!G40","v":0},{"$f":"'C5C'!H40","v":0},0,"",{"$f":"'C5C'!K40","v":0}]
[{"$f":"'Org structure'!A8","v":"Vote 07 - Infrastructure Development"},null,{"$f":"'C5C'!C49","v":0},{"$f":"'C5C'!D49","v":0},{"$f":"'C5C'!E49","v":0},{"$f":"'C5C'!F49","v":0},{"$f":"'C5C'!G49","v":0},{"$f":"'C5C'!H49","v":0},0,"",{"$f":"'C5C'!K49","v":0}]
[{"$f":"'Org structure'!A9","v":"Vote 08 - "},null,{"$f":"'C5C'!C54","v":0},{"$f":"'C5C'!D54","v":0},{"$f":"'C5C'!E54","v":0},{"$f":"'C5C'!F54","v":0},{"$f":"'C5C'!G54","v":0},{"$f":"'C5C'!H54","v":0},{"$f":"G13-H13","v":0},{"$f":"IF(I13=0,\"\",I13/H13)","v":""},{"$f":"'C5C'!K54","v":0}]
[{"$f":"'Org structure'!A10","v":"Vote 09 - "},null,{"$f":"'C5C'!C55","v":0},{"$f":"'C5C'!D55","v":0},{"$f":"'C5C'!E55","v":0},{"$f":"'C5C'!F55","v":0},{"$f":"'C5C'!G55","v":0},{"$f":"'C5C'!H55","v":0},0,"",{"$f":"'C5C'!K55","v":0}]
[{"$f":"'Org structure'!A11","v":"Vote 10 - "},null,{"$f":"'C5C'!C56","v":0},{"$f":"'C5C'!D56","v":0},{"$f":"'C5C'!E56","v":0},{"$f":"'C5C'!F56","v":0},{"$f":"'C5C'!G56","v":0},{"$f":"'C5C'!H56","v":0},0,"",{"$f":"'C5C'!K56","v":0}]
[{"$f":"'Org structure'!A12","v":"Vote 11 - "},null,{"$f":"'C5C'!C57","v":0},{"$f":"'C5C'!D57","v":0},{"$f":"'C5C'!E57","v":0},{"$f":"'C5C'!F57","v":0},{"$f":"'C5C'!G57","v":0},{"$f":"'C5C'!H57","v":0},0,"",{"$f":"'C5C'!K57","v":0}]
[{"$f":"'Org structure'!A13","v":"Vote 12 - "},null,{"$f":"'C5C'!C58","v":0},{"$f":"'C5C'!D58","v":0},{"$f":"'C5C'!E58","v":0},{"$f":"'C5C'!F58","v":0},{"$f":"'C5C'!G58","v":0},{"$f":"'C5C'!H58","v":0},0,"",{"$f":"'C5C'!K58","v":0}]
[{"$f":"'Org structure'!A14","v":"Vote 13 - "},null,{"$f":"'C5C'!C59","v":0},{"$f":"'C5C'!D59","v":0},{"$f":"'C5C'!E59","v":0},{"$f":"'C5C'!F59","v":0},{"$f":"'C5C'!G59","v":0},{"$f":"'C5C'!H59","v":0},{"$f":"G18-H18","v":0},{"$f":"IF(I18=0,\"\",I18/H18)","v":""},{"$f":"'C5C'!K59","v":0}]
[{"$f":"'Org structure'!A15","v":"Vote 14 - "},null,{"$f":"'C5C'!C60","v":0},{"$f":"'C5C'!D60","v":0},{"$f":"'C5C'!E60","v":0},{"$f":"'C5C'!F60","v":0},{"$f":"'C5C'!G60","v":0},{"$f":"'C5C'!H60","v":0},{"$f":"G19-H19","v":0},{"$f":"IF(I19=0,\"\",I19/H19)","v":""},{"$f":"'C5C'!K60","v":0}]
[{"$f":"'Org structure'!A16","v":"Vote 15 - Other"},null,{"$f":"'C5C'!C61","v":0},{"$f":"'C5C'!D61","v":0},{"$f":"'C5C'!E61","v":0},{"$f":"'C5C'!F61","v":0},{"$f":"'C5C'!G61","v":0},{"$f":"'C5C'!H61","v":0},{"$f":"G20-H20","v":0},{"$f":"IF(I20=0,\"\",I20/H20)","v":""},{"$f":"'C5C'!K61","v":0}]
["Total Capital Multi-year expenditure","4,7",{"$f":"SUM(C6:C20)","v":0},{"$f":"SUM(D6:D20)","v":0},0,0,0,0,0,{"$f":"IF(I21=0,\"\",I21/H21)","v":""},{"$f":"SUM(K6:K20)","v":0}]
[]
["Single Year expenditure appropriation",2]
[{"$f":"'C5C'!A66","v":"Vote 01 - Executive & Council"},null,{"$f":"'C5C'!C66","v":24205},{"$f":"'C5C'!D66","v":0},{"$f":"'C5C'!E66","v":0},{"$f":"'C5C'!F66","v":0},{"$f":"'C5C'!G66","v":0},{"$f":"'C5C'!H66","v":0},{"$f":"G24-H24","v":0},{"$f":"IF(I24=0,\"\",I24/H24)","v":""},{"$f":"'C5C'!K66","v":0}]
[{"$f":"'C5C'!A69","v":"Vote 02 - Municipal Manager"},null,{"$f":"'C5C'!C69","v":0},{"$f":"'C5C'!D69","v":0},{"$f":"'C5C'!E69","v":0},{"$f":"'C5C'!F69","v":0},{"$f":"'C5C'!G69","v":0},{"$f":"'C5C'!H69","v":0},0,"",{"$f":"'C5C'!K69","v":0}]
[{"$f":"'C5C'!A75","v":"Vote 03 - Corporate Services"},null,{"$f":"'C5C'!C75","v":0},{"$f":"'C5C'!D75","v":11493000},{"$f":"'C5C'!E75","v":12193000},{"$f":"'C5C'!F75","v":266056},{"$f":"'C5C'!G75","v":716180.06},{"$f":"'C5C'!H75","v":7842000},-7125819.9399999995,-0.90867380005100729,{"$f":"'C5C'!K75","v":12193000}]
[{"$f":"'C5C'!A83","v":"Vote 04 - Budget And Treasury"},null,{"$f":"'C5C'!C83","v":-565.22},{"$f":"'C5C'!D83","v":0},{"$f":"'C5C'!E83","v":0},{"$f":"'C5C'!F83","v":0},{"$f":"'C5C'!G83","v":0},{"$f":"'C5C'!H83","v":0},0,"",{"$f":"'C5C'!K83","v":0}]
[{"$f":"'C5C'!A90","v":"Vote 05 - Community Services"},null,{"$f":"'C5C'!C90","v":0},{"$f":"'C5C'!D90","v":25737000},{"$f":"'C5C'!E90","v":27414717},{"$f":"'C5C'!F90","v":0},{"$f":"'C5C'!G90","v":3876787.16},{"$f":"'C5C'!H90","v":18781560},-14904772.84,-0.79358545509531686,{"$f":"'C5C'!K90","v":27414717}]
[{"$f":"'C5C'!A99","v":"Vote 06 - Planning And Development"},null,{"$f":"'C5C'!C99","v":0},{"$f":"'C5C'!D99","v":11520000},{"$f":"'C5C'!E99","v":8520000},{"$f":"'C5C'!F99","v":0},{"$f":"'C5C'!G99","v":7800},{"$f":"'C5C'!H99","v":7080000},-7072200,-0.99889830508474575,{"$f":"'C5C'!K99","v":8520000}]
[{"$f":"'C5C'!A108","v":"Vote 07 - Infrastructure Development"},null,{"$f":"'C5C'!C108","v":13743928.039999999},{"$f":"'C5C'!D108","v":85918250},{"$f":"'C5C'!E108","v":116392073},{"$f":"'C5C'!F108","v":1511154.4999999998},{"$f":"'C5C'!G108","v":17835271.699999999},{"$f":"'C5C'!H108","v":72653604},-54818332.299999997,-0.75451635269187745,{"$f":"'C5C'!K108","v":116392073}]
[{"$f":"'Org structure'!A9","v":"Vote 08 - "},null,{"$f":"'C5C'!C113","v":0},{"$f":"'C5C'!D113","v":0},{"$f":"'C5C'!E113","v":0},{"$f":"'C5C'!F113","v":0},{"$f":"'C5C'!G113","v":0},{"$f":"'C5C'!H113","v":0},{"$f":"'C5C'!I113","v":0},{"$f":"IF(I31=0,\"\",I31/H31)","v":""},{"$f":"'C5C'!K113","v":0}]
[{"$f":"'Org structure'!A10","v":"Vote 09 - "},null,{"$f":"'C5C'!C114","v":0},{"$f":"'C5C'!D114","v":0},{"$f":"'C5C'!E114","v":0},{"$f":"'C5C'!F114","v":0},{"$f":"'C5C'!G114","v":0},{"$f":"'C5C'!H114","v":0},{"$f":"'C5C'!I114","v":0},"",{"$f":"'C5C'!K114","v":0}]
[{"$f":"'Org structure'!A11","v":"Vote 10 - "},null,{"$f":"'C5C'!C115","v":0},{"$f":"'C5C'!D115","v":0},{"$f":"'C5C'!E115","v":0},{"$f":"'C5C'!F115","v":0},{"$f":"'C5C'!G115","v":0},{"$f":"'C5C'!H115","v":0},{"$f":"'C5C'!I115","v":0},"",{"$f":"'C5C'!K115","v":0}]
[{"$f":"'Org structure'!A12","v":"Vote 11 - "},null,{"$f":"'C5C'!C116","v":0},{"$f":"'C5C'!D116","v":0},{"$f":"'C5C'!E116","v":0},{"$f":"'C5C'!F116","v":0},{"$f":"'C5C'!G116","v":0},{"$f":"'C5C'!H116","v":0},{"$f":"'C5C'!I116","v":0},"",{"$f":"'C5C'!K116","v":0}]
[{"$f":"'Org structure'!A13","v":"Vote 12 - "},null,{"$f":"'C5C'!C117","v":0},{"$f":"'C5C'!D117","v":0},{"$f":"'C5C'!E117","v":0},{"$f":"'C5C'!F117","v":0},{"$f":"'C5C'!G117","v":0},{"$f":"'C5C'!H117","v":0},{"$f":"'C5C'!I117","v":0},"",{"$f":"'C5C'!K117","v":0}]
[{"$f":"'Org structure'!A14","v":"Vote 13 - "},null,{"$f":"'C5C'!C118","v":0},{"$f":"'C5C'!D118","v":0},{"$f":"'C5C'!E118","v":0},{"$f":"'C5C'!F118","v":0},{"$f":"'C5C'!G118","v":0},{"$f":"'C5C'!H118","v":0},{"$f":"'C5C'!I118","v":0},"",{"$f":"'C5C'!K118","v":0}]
[{"$f":"'Org structure'!A15","v":"Vote 14 - "},null,{"$f":"'C5C'!C119","v":0},{"$f":"'C5C'!D119","v":0},{"$f":"'C5C'!E119","v":0},{"$f":"'C5C'!F119","v":0},{"$f":"'C5C'!G119","v":0},{"$f":"'C5C'!H119","v":0},{"$f":"'C5C'!I119","v":0},"",{"$f":"'C5C'!K119","v":0}]
[{"$f":"'Org structure'!A16","v":"Vote 15 - Other"},null,{"$f":"'C5C'!C120","v":0},{"$f":"'C5C'!D120","v":0},{"$f":"'C5C'!E120","v":0},{"$f":"'C5C'!F120","v":0},{"$f":"'C5C'!G120","v":0},{"$f":"'C5C'!H120","v":0},{"$f":"'C5C'!I120","v":0},"",{"$f":"'C5C'!K120","v":0}]
["Total Capital single-year expenditure",4,{"$f":"SUM(C24:C38)","v":13767567.819999998},134668250,164519790,1777210.4999999998,22436038.920000002,106357164,-83921125.079999998,-0.7890500453735303,{"$f":"SUM(K24:K38)","v":164519790}]
["Total Capital Expenditure",null,{"$f":"C39+C21","v":13767567.819999998},134668250,164519790,1777210.4999999998,22436038.920000002,106357164,-83921125.079999998,{"$f":"IF(I40=0,\"\",I40/H40)","v":-0.7890500453735303},{"$f":"K39+K21","v":164519790}]
[]
["Capital Expenditure - Functional Classification"]
["Governance and administration",null,{"$f":"SUM(C44:C46)","v":23639.78},11493000,12193000,266056,716180.06,7842000,{"$f":"G43-H43","v":-7125819.9399999995},{"$f":"IF(I43=0,\"\",I43/H43)","v":-0.90867380005100729},{"$f":"SUM(K44:K46)","v":12193000}]
["Executive and council",null,null,null,null,null,null,null,0,{"$f":"IF(I44=0,\"\",I44/H44)","v":""}]
["Finance and administration",null,23639.78,11493000,12193000,266056,716180.06,7842000,-7125819.9399999995,-0.90867380005100729,12193000]
["Internal audit",null,null,null,null,null,null,null,0,""]
["Community and public safety",null,{"$f":"SUM(C48:C52)","v":0},10337000,14714717,0,3876787.16,9934888,-6058100.8399999999,-0.60978048670503382,{"$f":"SUM(K48:K52)","v":14714717}]
["Community and social services",null,0,10137000,12914717,0,3679287.16,8681552,-5002264.84,-0.57619476794011026,12914717]
["Sport and recreation",null,null,null,null,null,null,null,0,""]
["Public safety",null,0,200000,1800000,0,197500,1253336,-1055836,-0.84242054804138711,1800000]
["Housing",null,null,null,null,null,null,null,0,""]
["Health",null,null,null,null,null,null,null,0,""]
["Economic and environmental services",null,{"$f":"SUM(C54:C56)","v":13632800.43},106313250,129162073,1511154.4999999998,15569191.699999999,84725276,-69156084.299999997,-0.81623911499562418,{"$f":"SUM(K54:K56)","v":129162073}]
["Planning and development",null,8736597.3699999992,62068250,75648073,3494138.8,9884046.3499999996,44094812,-34210765.649999999,-0.77584559494209882,75648073]
["Road transport",null,4896203.0599999996,43725000,52994000,-1982984.3,5677345.3499999996,40283800,-34606454.649999999,-0.85906629091595132,52994000]
["Environmental protection",null,0,520000,520000,0,7800,346664,-338864,-0.97749982692174553,520000]
["Trading services",null,{"$f":"SUM(C58:C61)","v":111127.61},6525000,8450000,0,2273880,3855000,-1581120,-0.410147859922179,{"$f":"SUM(K58:K61)","v":8450000}]
["Energy sources",null,111127.61,4125000,8250000,0,2273880,3575000,-1301120,-0.36394965034965032,8250000]
["Water management",null,null,null,null,null,null,null,0,""]
["Waste water management",null,null,null,null,null,null,null,0,""]
["Waste management",null,0,2400000,200000,0,0,280000,-280000,-1,200000]
["Other",null,null,null,null,null,null,null,0,""]
["Total Capital Expenditure - Functional Classification",3,{"$f":"C43+C47+C53+C57+C62","v":13767567.819999998},{"$f":"D43+D47+D53+D57+D62","v":134668250},164519790,1777210.4999999998,22436038.920000002,106357164,-83921125.079999998,-0.7890500453735303,{"$f":"K43+K47+K53+K57+K62","v":164519790}]
[]
["Funded by:"]
["National Government",null,8736597.3699999992,54318250,67648073,3494138.8,9884046.3499999996,37578140,{"$f":"G66-H66","v":-27694093.649999999},{"$f":"IF(I66=0,\"\",I66/H66)","v":-0.73697350773614656},67648073]
["Provincial Government",null,0,0,0,0,0,0,0,"",0]
["District Municipality",null,null,null,null,null,null,null,0,""]
[{"$f":"'C4-FinPerf RE'!A40","v":"Transfers and subsidies - capital (monetary allocations) (National / Provincial Departmental Agencies, Households, Non-profit Institutions, Private Enterprises, Public Corporatons, Higher Educational Institutions)"},null,null,null,null,null,null,null,0,""]
["Transfers recognised - capital",null,{"$f":"SUM(C66:C69)","v":8736597.3699999992},54318250,67648073,3494138.8,9884046.3499999996,37578140,-27694093.649999999,-0.73697350773614656,{"$f":"SUM(K66:K69)","v":67648073}]
[]
["Borrowing",6,null,null,null,null,null,null,0,""]
["Internally generated funds",null,5030970.45,80350000,96871717,-1716928.3,12551992.57,68779024,-56227031.43,-0.81750260704484556,96871717]
["Total Capital Funding",null,{"$f":"+C70+C72+C73","v":13767567.82},134668250,164519790,1777210.4999999998,22436038.920000002,106357164,-83921125.079999998,-0.7890500453735303,{"$f":"+K70+K72+K73","v":164519790}]
[{"$f":"head27a","v":"References"}]
["1. Municipalities may choose to appropriate for capital expenditure for three years or for one year (if one year appropriation projected expenditure required for yr2 and yr3)."]
["2. Include capital component of PPP unitary payment"]
["3. Capital expenditure by functional classification must reconcile to the total of multi-year and single year appropriations"]
["4. Include expenditure on investment property, intangible and biological assets"]
[]
["6. Include finance leases and PPP capital funding component of unitary payment - total borrowing/repayments to reconcile to changes in Table SA17"]
[]
[]
[]
[]
["check balance",null,{"$f":"C40-C74","v":0},{"$f":"D40-D74","v":0},0,0,0,0,null,null,0]

{"sheet":"C5C","index":13,"n_rows":124,"n_cols":23,"rows_kept":124,"cut":false,"hidden":false,"merged":[[1,3,1,10],[1,11,1,22],[0,0,0,10]]}
[{"$f":"muni& \" - \"&S71D& \" - \"&\"A\"& \" - \"&date","v":"LIM355 Lepelle-Nkumpi - Table C5 Monthly Budget Statement - Capital Expenditure (municipal vote, functional classification and funding) - A - M08 February"}]
[{"$f":"Vdesc","v":"Vote Description"},{"$f":"head27","v":"Ref"},{"$f":"Head1","v":"2019/20"},{"$f":"Head2","v":"Budget Year 2020/21"},null,null,null,null,null,null,null,{"$f":"Head4","v":{"$error":"#REF!"}}]
["R thousand",null,{"$f":"Head5","v":"Audited Outcome"},{"$f":"Head6","v":"Original Budget"},{"$f":"Head7","v":"Adjusted Budget"},{"$f":"Head38","v":"Monthly actual"},{"$f":"Head39","v":"YearTD actual"},{"$f":"Head40","v":"YearTD budget"},{"$f":"Head41","v":"YTD variance"},{"$f":"Head41","v":"YTD variance"},{"$f":"Head8","v":"Full Year Forecast"},{"$f":"Head12","v":"Forecast 2010/11"},{"$f":"Head13","v":"Forecast 2011/12"},{"$f":"Head14","v":"Forecast 2012/13"},{"$f":"Head15","v":"Forecast 2013/14"},{"$f":"Head16","v":"Forecast 2014/15"},{"$f":"Head17","v":"Forecast 2015/16"},{"$f":"Head18","v":"Forecast 2016/17"},{"$f":"Head19","v":"Forecast 2017/18"},{"$f":"Head20","v":"Forecast 2018/19"},{"$f":"Head21","v":"Forecast 2019/20"},{"$f":"Head22","v":"Forecast 2020/21"},{"$f":"Head23","v":"Forecast 2021/22"}]
[null,null,null,null,null,null,null,null,null,"%"]
["Capital expenditure - Municipal Vote"]
["Expenditure of multi-year capital appropriation",1]
[{"$f":"'Org structure'!A2","v":"Vote 01 - Executive & Council"},null,{"$f":"SUM(C8:C9)","v":0},0,0,0,0,0,{"$f":"G7-H7","v":0},{"$f":"IF(I7=0,\"\",I7/H7)","v":""},{"$f":"SUM(K8:K9)","v":0}]
[{"$f":"'Org structure'!E3","v":"01.1 - Mayor & Councillors"},null,null,null,null,null,null,null,{"$f":"G8-H8","v":0},{"$f":"IF(I8=0,\"\",I8/H8)","v":""},0]
[{"$f":"'Org structure'!E4","v":"01.2 - Mayor & Council Support"},null,null,null,null,null,null,null,{"$f":"G9-H9","v":0},{"$f":"IF(I9=0,\"\",I9/H9)","v":""},0]
[{"$f":"'Org structure'!A3","v":"Vote 02 - Municipal Manager"},null,{"$f":"SUM(C11:C15)","v":0},0,0,0,0,0,0,"",{"$f":"SUM(K11:K15)","v":0}]
[{"$f":"'Org structure'!E6","v":"02.1 - Municipal Manager"},null,null,null,null,null,null,null,{"$f":"G11-H11","v":0},{"$f":"IF(I11=0,\"\",I11/H11)","v":""},0]
[{"$f":"'Org structure'!E7","v":"02.2 - Municipal Manager Support"},null,null,null,null,null,null,null,{"$f":"G12-H12","v":0},{"$f":"IF(I12=0,\"\",I12/H12)","v":""},0]
[{"$f":"'Org structure'!E8","v":"02.3 - Internal Audit"},null,null,null,null,null,null,null,{"$f":"G13-H13","v":0},{"$f":"IF(I13=0,\"\",I13/H13)","v":""},0]
[{"$f":"'Org structure'!E9","v":"02.4 - Communications"},null,null,null,null,null,null,null,{"$f":"G14-H14","v":0},{"$f":"IF(I14=0,\"\",I14/H14)","v":""},0]
[{"$f":"'Org structure'!E10","v":"02.5 - Risk Management"},null,null,null,null,null,null,null,{"$f":"G15-H15","v":0},{"$f":"IF(I15=0,\"\",I15/H15)","v":""},0]
[{"$f":"'Org structure'!A4","v":"Vote 03 - Corporate Services"},null,{"$f":"SUM(C17:C23)","v":0},0,0,0,0,0,0,"",{"$f":"SUM(K17:K23)","v":0}]
[{"$f":"'Org structure'!E12","v":"03.1 - Executive Manager: Corporate Services"},null,null,null,null,null,null,null,{"$f":"G17-H17","v":0},{"$f":"IF(I17=0,\"\",I17/H17)","v":""},0]
[{"$f":"'Org structure'!E13","v":"03.2 - Human Resource Management & Development"},null,null,null,null,null,null,null,0,"",0]
[{"$f":"'Org structure'!E14","v":"03.3 - Information Technology"},null,null,null,null,null,null,null,0,"",0]
[{"$f":"'Org structure'!E15","v":"03.4 - Legal Services"},null,null,null,null,null,null,null,0,"",0]
[{"$f":"'Org structure'!E16","v":"03.5 - Gen Adm_Sec_Fleet: General Administrat"},null,null,null,null,null,null,null,0,"",0]
[{"$f":"'Org structure'!E17","v":"03.6 - Gen Adm_Sec_Fleet: Security Services"},null,null,null,null,null,null,null,0,"",0]
[{"$f":"'Org structure'!E18","v":"03.7 - Gen Adm_Sec_Fleet: Fleet Management"},null,null,null,null,null,null,null,0,"",0]
[{"$f":"'Org structure'!A5","v":"Vote 04 - Budget And Treasury"},null,{"$f":"SUM(C25:C30)","v":0},0,0,0,0,0,0,"",{"$f":"SUM(K25:K30)","v":0}]
[{"$f":"'Org structure'!E20","v":"04.1 - Chief Financial Officer"},null,null,null,null,null,null,null,{"$f":"G25-H25","v":0},{"$f":"IF(I25=0,\"\",I25/H25)","v":""},0]
[{"$f":"'Org structure'!E21","v":"04.2 - Budget Planning & Management"},null,null,null,null,null,null,null,0,"",0]
[{"$f":"'Org structure'!E22","v":"04.3 - Expenditure Management"},null,null,null,null,null,null,null,0,"",0]
[{"$f":"'Org structure'!E23","v":"04.4 - Revenue Management"},null,null,null,null,null,null,null,0,"",0]
[{"$f":"'Org structure'!E24","v":"04.5 - Asset Management"},null,null,null,null,null,null,null,0,"",0]
[{"$f":"'Org structure'!E25","v":"04.6 - Supply Chain Management"},null,null,null,null,null,null,null,0,"",0]
[{"$f":"'Org structure'!A6","v":"Vote 05 - Community Services"},null,{"$f":"SUM(C32:C39)","v":0},0,0,0,0,0,0,"",{"$f":"SUM(K32:K39)","v":0}]
[{"$f":"'Org structure'!E27","v":"05.1 - Executive Manager: Community Services"},null,null,null,null,null,null,null,{"$f":"G32-H32","v":0},{"$f":"IF(I32=0,\"\",I32/H32)","v":""},0]
[{"$f":"'Org structure'!E28","v":"05.2 - Waste Management Services"},null,null,null,null,null,null,null,0,"",0]
[{"$f":"'Org structure'!E29","v":"05.3 - Road Traffic & Law Enforce: Traffic Serv"},null,null,null,null,null,null,null,0,"",0]
[{"$f":"'Org structure'!E30","v":"05.4 - Road Traffic&Law Enforce: Licencing Serv"},null,null,null,null,null,null,null,0,"",0]
[{"$f":"'Org structure'!E31","v":"05.5 - Road Traffic&Law Enforce: Pound"},null,null,null,null,null,null,null,0,"",0]
[{"$f":"'Org structure'!E32","v":"05.6 - Institutional & Social Dev Management"},null,null,null,null,null,null,null,0,"",0]
[{"$f":"'Org structure'!E33","v":"05.7 - Libraries And Archives"},null,null,null,null,null,null,null,0,"",0]
[{"$f":"'Org structure'!E34","v":"05.8 - Community Halls And Facilities"},null,null,null,null,null,null,null,0,"",0]
[{"$f":"'Org structure'!A7","v":"Vote 06 - Planning And Development"},null,{"$f":"SUM(C41:C48)","v":0},0,0,0,0,0,0,"",{"$f":"SUM(K41:K48)","v":0}]
[{"$f":"'Org structure'!E36","v":"06.1 - Executive Manager:Planning & Development"},null,null,null,null,null,null,null,{"$f":"G41-H41","v":0},{"$f":"IF(I41=0,\"\",I41/H41)","v":""},0]
[{"$f":"'Org structure'!E37","v":"06.2 - Economic Development & Planning"},null,null,null,null,null,null,null,0,"",0]
[{"$f":"'Org structure'!E38","v":"06.3 - Development & Town Planning"},null,null,null,null,null,null,null,0,"",0]
[{"$f":"'Org structure'!E39","v":"06.4 - Property Management & Housing"},null,null,null,null,null,null,null,0,"",0]
[{"$f":"'Org structure'!E40","v":"06.5 - Integrated Development Planning"},null,null,null,null,null,null,null,0,"",0]
[{"$f":"'Org structure'!E41","v":"06.6 - Performance Management"},null,null,null,null,null,null,null,0,"",0]
[{"$f":"'Org structure'!E42","v":"06.7 - Environmental Management Services"},null,null,null,null,null,null,null,0,"",0]
[{"$f":"'Org structure'!E43","v":"06.8 - Disaster Management"},null,null,null,null,null,null,null,0,"",0]
[{"$f":"'Org structure'!A8","v":"Vote 07 - Infrastructure Development"},null,{"$f":"SUM(C50:C53)","v":0},0,0,0,0,0,{"$f":"G49-H49","v":0},{"$f":"IF(I49=0,\"\",I49/H49)","v":""},{"$f":"SUM(K50:K53)","v":0}]
[{"$f":"'Org structure'!E45","v":"07.1 - Executive Manager: Infrastructure Dev"},null,null,null,null,null,null,null,{"$f":"G50-H50","v":0},{"$f":"IF(I50=0,\"\",I50/H50)","v":""},0]
[{"$f":"'Org structure'!E46","v":"07.2 - Road Construction & Maintenance"},null,null,null,null,null,null,null,{"$f":"G51-H51","v":0},{"$f":"IF(I51=0,\"\",I51/H51)","v":""},0]
[{"$f":"'Org structure'!E47","v":"07.3 - Electrical & Mechanical Works"},null,null,null,null,null,null,null,{"$f":"G52-H52","v":0},{"$f":"IF(I52=0,\"\",I52/H52)","v":""},0]
[{"$f":"'Org structure'!E48","v":"07.4 - Project Management"},null,null,null,null,null,null,null,{"$f":"G53-H53","v":0},{"$f":"IF(I53=0,\"\",I53/H53)","v":""},0]
[{"$f":"'Org structure'!A9","v":"Vote 08 - "},null,0,0,0,0,0,0,0,"",0]
[{"$f":"'Org structure'!A10","v":"Vote 09 - "},null,0,0,0,0,0,0,0,"",0]
[{"$f":"'Org structure'!A11","v":"Vote 10 - "},null,0,0,0,0,0,0,0,"",0]
[{"$f":"'Org structure'!A12","v":"Vote 11 - "},null,0,0,0,0,0,0,0,"",0]
[{"$f":"'Org structure'!A13","v":"Vote 12 - "},null,0,0,0,0,0,0,0,"",0]
[{"$f":"'Org structure'!A14","v":"Vote 13 - "},null,0,0,0,0,0,0,{"$f":"G59-H59","v":0},{"$f":"IF(I59=0,\"\",I59/H59)","v":""},0]
[{"$f":"'Org structure'!A15","v":"Vote 14 - "},null,0,0,0,0,0,0,0,"",0]
[{"$f":"'Org structure'!A16","v":"Vote 15 - Other"},null,0,0,0,0,0,0,0,"",0]
["Total multi-year capital expenditure",null,{"$f":"C7+C10+C16+C24+C31+C40+C49+C54+C55+C56+C57+C58+C59+C60+C61","v":0},0,0,0,0,0,0,"",{"$f":"K7+K10+K16+K24+K31+K40+K49+K54+K55+K56+K57+K58+K59+K60+K61","v":0}]
[null,null,null,null,null,null,null,null,0,""]
["Capital expenditure - Municipal Vote"]
["Expenditue of single-year capital appropriation",1,null,null,null,null,null,null,0,""]
[{"$f":"'Org structure'!A2","v":"Vote 01 - Executive & Council"},null,{"$f":"SUM(C67:C68)","v":24205},0,0,0,0,0,0,"",{"$f":"SUM(K67:K68)","v":0}]
[{"$f":"'Org structure'!E3","v":"01.1 - Mayor & Councillors"},null,0,0,0,0,0,0,0,"",0]
[{"$f":"'Org structure'!E4","v":"01.2 - Mayor & Council Support"},null,24205,0,0,0,0,0,0,"",0]
[{"$f":"'Org structure'!A3","v":"Vote 02 - Municipal Manager"},null,{"$f":"SUM(C70:C74)","v":0},0,0,0,0,0,0,"",{"$f":"SUM(K70:K74)","v":0}]
[{"$f":"'Org structure'!E6","v":"02.1 - Municipal Manager"},null,0,0,0,0,0,0,0,"",0]
[{"$f":"'Org structure'!E7","v":"02.2 - Municipal Manager Support"},null,0,0,0,0,0,0,0,"",0]
[{"$f":"'Org structure'!E8","v":"02.3 - Internal Audit"},null,0,0,0,0,0,0,0,"",0]
[{"$f":"'Org structure'!E9","v":"02.4 - Communications"},null,0,0,0,0,0,0,0,"",0]
[{"$f":"'Org structure'!E10","v":"02.5 - Risk Management"},null,0,0,0,0,0,0,0,"",0]
[{"$f":"'Org structure'!A4","v":"Vote 03 - Corporate Services"},null,{"$f":"SUM(C76:C82)","v":0},11493000,12193000,266056,716180.06,7842000,-7125819.9399999995,-0.90867380005100729,{"$f":"SUM(K76:K82)","v":12193000}]
[{"$f":"'Org structure'!E12","v":"03.1 - Executive Manager: Corporate Services"},null,0,0,0,0,0,0,0,"",0]
[{"$f":"'Org structure'!E13","v":"03.2 - Human Resource Management & Development"},null,0,0,0,0,0,0,{"$f":"G77-H77","v":0},{"$f":"IF(I77=0,\"\",I77/H77)","v":""},0]
[{"$f":"'Org structure'!E14","v":"03.3 - Information Technology"},null,0,1343000,2043000,38556,450217.56,1075336,-625118.43999999994,-0.58132382808722105,2043000]
[{"$f":"'Org structure'!E15","v":"03.4 - Legal Services"},null,0,0,0,0,0,0,0,"",0]
[{"$f":"'Org structure'!E16","v":"03.5 - Gen Adm_Sec_Fleet: General Administrat"},null,0,9850000,9850000,0,0,6566664,-6566664,-1,9850000]
[{"$f":"'Org structure'!E17","v":"03.6 - Gen Adm_Sec_Fleet: Security Services"},null,0,300000,300000,227500,265962.5,200000,65962.5,0.32981250000000001,300000]
[{"$f":"'Org structure'!E18","v":"03.7 - Gen Adm_Sec_Fleet: Fleet Management"},null,0,0,0,0,0,0,0,"",0]
[{"$f":"'Org structure'!A5","v":"Vote 04 - Budget And Treasury"},null,{"$f":"SUM(C84:C89)","v":-565.22},0,0,0,0,0,0,"",{"$f":"SUM(K84:K89)","v":0}]
[{"$f":"'Org structure'!E20","v":"04.1 - Chief Financial Officer"},null,0,0,0,0,0,0,0,"",0]
[{"$f":"'Org structure'!E21","v":"04.2 - Budget Planning & Management"},null,0,0,0,0,0,0,0,"",0]
[{"$f":"'Org structure'!E22","v":"04.3 - Expenditure Management"},null,0,0,0,0,0,0,0,"",0]
[{"$f":"'Org structure'!E23","v":"04.4 - Revenue Management"},null,-565.22,0,0,0,0,0,0,"",0]
[{"$f":"'Org structure'!E24","v":"04.5 - Asset Management"},null,0,0,0,0,0,0,0,"",0]
[{"$f":"'Org structure'!E25","v":"04.6 - Supply Chain Management"},null,0,0,0,0,0,0,0,"",0]
[{"$f":"'Org structure'!A6","v":"Vote 05 - Community Services"},null,{"$f":"SUM(C91:C98)","v":0},25737000,27414717,0,3876787.16,18781560,-14904772.84,-0.79358545509531686,{"$f":"SUM(K91:K98)","v":27414717}]
[{"$f":"'Org structure'!E27","v":"05.1 - Executive Manager: Community Services"},null,0,0,0,0,0,0,0,"",0]
[{"$f":"'Org structure'!E28","v":"05.2 - Waste Management Services"},null,0,2400000,200000,0,0,280000,-280000,-1,200000]
[{"$f":"'Org structure'!E29","v":"05.3 - Road Traffic & Law Enforce: Traffic Serv"},null,0,200000,1800000,0,197500,1253336,-1055836,-0.84242054804138711,1800000]
[{"$f":"'Org structure'!E30","v":"05.4 - Road Traffic&Law Enforce: Licencing Serv"},null,0,13000000,12500000,0,0,8566672,-8566672,-1,12500000]
[{"$f":"'Org structure'!E31","v":"05.5 - Road Traffic&Law Enforce: Pound"},null,0,0,0,0,0,0,0,"",0]
[{"$f":"'Org structure'!E32","v":"05.6 - Institutional & Social Dev Management"},null,0,0,0,0,0,0,0,"",0]
[{"$f":"'Org structure'!E33","v":"05.7 - Libraries And Archives"},null,0,0,0,0,0,0,0,"",0]
[{"$f":"'Org structure'!E34","v":"05.8 - Community Halls And Facilities"},null,0,10137000,12914717,0,3679287.16,8681552,-5002264.84,-0.57619476794011026,12914717]
[{"$f":"'Org structure'!A7","v":"Vote 06 - Planning And Development"},null,{"$f":"SUM(C100:C107)","v":0},11520000,8520000,0,7800,7080000,-7072200,-0.99889830508474575,{"$f":"SUM(K100:K107)","v":8520000}]
[{"$f":"'Org structure'!E36","v":"06.1 - Executive Manager:Planning & Development"},null,0,0,0,0,0,0,0,"",0]
[{"$f":"'Org structure'!E37","v":"06.2 - Economic Development & Planning"},null,0,3000000,0,0,0,1400000,-1400000,-1,0]
[{"$f":"'Org structure'!E38","v":"06.3 - Development & Town Planning"},null,0,8000000,8000000,0,0,5333336,-5333336,-1,8000000]
[{"$f":"'Org structure'!E39","v":"06.4 - Property Management & Housing"},null,0,0,0,0,0,0,0,"",0]
[{"$f":"'Org structure'!E40","v":"06.5 - Integrated Development Planning"},null,0,0,0,0,0,0,0,"",0]
[{"$f":"'Org structure'!E41","v":"06.6 - Performance Management"},null,0,0,0,0,0,0,0,"",0]
[{"$f":"'Org structure'!E42","v":"06.7 - Environmental Management Services"},null,0,520000,520000,0,7800,346664,-338864,-0.97749982692174553,520000]
[{"$f":"'Org structure'!E43","v":"06.8 - Disaster Management"},null,0,0,0,0,0,0,0,"",0]
[{"$f":"'Org structure'!A8","v":"Vote 07 - Infrastructure Development"},null,{"$f":"SUM(C109:C112)","v":13743928.039999999},85918250,116392073,1511154.4999999998,17835271.699999999,72653604,-54818332.299999997,-0.75451635269187745,{"$f":"SUM(K109:K112)","v":116392073}]
[{"$f":"'Org structure'!E45","v":"07.1 - Executive Manager: Infrastructure Dev"},null,0,0,0,0,0,0,0,"",0]
[{"$f":"'Org structure'!E46","v":"07.2 - Road Construction & Maintenance"},null,4896203.0599999996,30725000,40494000,-1982984.3,5677345.3499999996,31717128,-26039782.649999999,-0.82100064829325026,40494000]
[{"$f":"'Org structure'!E47","v":"07.3 - Electrical & Mechanical Works"},null,111127.61,4125000,8250000,0,2273880,3575000,-1301120,-0.36394965034965032,8250000]
[{"$f":"'Org structure'!E48","v":"07.4 - Project Management"},null,8736597.3699999992,51068250,67648073,3494138.8,9884046.3499999996,37361476,-27477429.649999999,-0.73544818331053086,67648073]
[{"$f":"'Org structure'!A9","v":"Vote 08 - "},null,0,0,0,0,0,0,0,"",0]
[{"$f":"'Org structure'!A10","v":"Vote 09 - "},null,0,0,0,0,0,0,{"$f":"G114-H114","v":0},{"$f":"IF(I114=0,\"\",I114/H114)","v":""},0]
[{"$f":"'Org structure'!A11","v":"Vote 10 - "},null,0,0,0,0,0,0,0,"",0]
[{"$f":"'Org structure'!A12","v":"Vote 11 - "},null,0,0,0,0,0,0,0,"",0]
[{"$f":"'Org structure'!A13","v":"Vote 12 - "},null,0,0,0,0,0,0,0,"",0]
[{"$f":"'Org structure'!A14","v":"Vote 13 - "},null,0,0,0,0,0,0,0,"",0]
[{"$f":"'Org structure'!A15","v":"Vote 14 - "},null,0,0,0,0,0,0,0,"",0]
[{"$f":"'Org structure'!A16","v":"Vote 15 - Other"},null,0,0,0,0,0,0,{"$f":"G120-H120","v":0},{"$f":"IF(I120=0,\"\",I120/H120)","v":""},0]
["Total single-year capital expenditure",null,{"$f":"C66+C69+C75+C83+C90+C99+C108+C113+C114+C115+C116+C117+C118+C119+C120","v":13767567.819999998},134668250,164519790,1777210.4999999998,22436038.920000002,106357164,-83921125.079999998,-0.7890500453735303,{"$f":"K66+K69+K75+K83+K90+K99+K108+K113+K114+K115+K116+K117+K118+K119+K120","v":164519790}]
["Total Capital Expenditure",null,{"$f":"C62+C121","v":13767567.819999998},134668250,164519790,1777210.4999999998,22436038.920000002,106357164,-83921125.079999998,-0.7890500453735303,{"$f":"K62+K121","v":164519790}]
[{"$f":"head27a","v":"References"}]
["1. Insert 'Vote'; e.g. Department, if different to standard structure"]

{"sheet":"C6-FinPos","index":14,"n_rows":54,"n_cols":7,"rows_kept":54,"cut":false,"hidden":false,"merged":[[1,0,2,0],[1,1,2,1],[49,0,49,6],[0,0,0,6]]}
[{"$f":"muni& \" - \"&S71E& \" - \"&date","v":"LIM355 Lepelle-Nkumpi - Table C6 Monthly Budget Statement - Financial Position - M08 February"}]
[{"$f":"desc","v":"Description"},{"$f":"head27","v":"Ref"},{"$f":"Head1","v":"2019/20"},{"$f":"Head2","v":"Budget Year 2020/21"}]
[null,null,{"$f":"Head5","v":"Audited Outcome"},{"$f":"Head6","v":"Original Budget"},{"$f":"Head7","v":"Adjusted Budget"},{"$f":"Head39","v":"YearTD actual"},{"$f":"Head8","v":"Full Year Forecast"}]
["R thousands",1]
["ASSETS"]
["Current assets"]
["Cash",null,-10364174.710000001,-312500425,-269711729,-5025178.91,-269711729]
["Call investment deposits",null,86700994.799999997,385400941,594556404,254120823.65000001,594556404]
["Consumer debtors",null,26678713.580000002,85826168,85826168,107489513.27,85826168]
["Other debtors",null,1249070.4099999999,-2358821,-2358821,9003378.9299999997,-2358821]
["Current portion of long-term receivables"]
["Inventory",null,369505,114742333,114742333,42814395.090000004,114742333]
["Total current assets",null,{"$f":"SUM(C7:C12)","v":104634109.08},{"$f":"SUM(D7:D12)","v":271110196},{"$f":"SUM(E7:E12)","v":523054355},{"$f":"SUM(F7:F12)","v":408402932.02999997},{"$f":"SUM(G7:G12)","v":523054355}]
[]
["Non current assets"]
["Long-term receivables",null,0,0,0,0,0]
["Investments",null,0,0,0,150000000,0]
["Investment property",null,0,117414000,117414000,146641000,117414000]
["Investments in Associate"]
["Property, plant and equipment",null,13767567.82,719846507,749698047,754662002.89999998,749698047]
[]
["Biological"]
["Intangible",null,0,85831,85831,175655.42,85831]
["Other non-current assets",null,0,0,0,183684.33,0]
["Total non current assets",null,{"$f":"SUM(C16:C20)+SUM(C22:C24)","v":13767567.82},{"$f":"SUM(D16:D20)+SUM(D22:D24)","v":837346338},{"$f":"SUM(E16:E20)+SUM(E22:E24)","v":867197878},{"$f":"SUM(F16:F20)+SUM(F22:F24)","v":1051662342.65},{"$f":"SUM(G16:G20)+SUM(G22:G24)","v":867197878}]
["TOTAL ASSETS",null,{"$f":"C13+C25","v":118401676.90000001},{"$f":"D13+D25","v":1108456534},{"$f":"E13+E25","v":1390252233},{"$f":"F13+F25","v":1460065274.6799998},{"$f":"G13+G25","v":1390252233}]
[]
["LIABILITIES"]
["Current liabilities"]
["Bank overdraft",null,0,0,0,0,0]
["Borrowing",null,0,0,0,-238137.84,0]
["Consumer deposits",null,-5000,1886836,1886836,2113252.13,1886836]
["Trade and other payables",null,18722977.869999997,67249314,67249314,147525496.48000002,67249314]
["Provisions",null,0,0,0,20162233.940000001,0]
["Total current liabilities",null,{"$f":"SUM(C30:C34)","v":18717977.869999997},{"$f":"SUM(D30:D34)","v":69136150},{"$f":"SUM(E30:E34)","v":69136150},{"$f":"SUM(F30:F34)","v":169562844.71000001},{"$f":"SUM(G30:G34)","v":69136150}]
[]
["Non current liabilities"]
["Borrowing",null,0,0,0,238138.31,0]
["Provisions",null,0,14246863,14246863,0,14246863]
["Total non current liabilities",null,{"$f":"SUM(C38:C39)","v":0},{"$f":"SUM(D38:D39)","v":14246863},{"$f":"SUM(E38:E39)","v":14246863},{"$f":"SUM(F38:F39)","v":238138.31},{"$f":"SUM(G38:G39)","v":14246863}]
["TOTAL LIABILITIES",null,{"$f":"C35+C40","v":18717977.869999997},{"$f":"D35+D40","v":83383013},{"$f":"E35+E40","v":83383013},{"$f":"F35+F40","v":169800983.02000001},{"$f":"G35+G40","v":83383013}]
[]
["NET ASSETS",2,{"$f":"C26-C41","v":99683699.030000001},{"$f":"D26-D41","v":1025073521},{"$f":"E26-E41","v":1306869220},{"$f":"F26-F41","v":1290264291.6599998},{"$f":"G26-G41","v":1306869220}]
[]
["COMMUNITY WEALTH/EQUITY"]
["Accumulated Surplus/(Deficit)",null,-138710.1,890405271,1000994177,1422096940.5,1000994177]
["Reserves",null,0,0,0,12781450.779999999,0]
["TOTAL COMMUNITY WEALTH/EQUITY",2,{"$f":"SUM(C46:C47)","v":-138710.1},{"$f":"SUM(D46:D47)","v":890405271},{"$f":"SUM(E46:E47)","v":1000994177},{"$f":"SUM(F46:F47)","v":1434878391.28},{"$f":"SUM(G46:G47)","v":1000994177}]
[{"$f":"head27a","v":"References"}]
["1. Material variances to be explained in Table SC1"]
["2. Net assets must balance with Total Community Wealth/Equity"]
[]
[]
["check balance",null,{"$f":"C43-C48","v":99822409.129999995},{"$f":"D43-D48","v":134668250},{"$f":"E43-E48","v":305875043},{"$f":"F43-F48","v":-144614099.62000012},{"$f":"G43-G48","v":305875043}]

{"sheet":"C7-CFlow","index":15,"n_rows":43,"n_cols":11,"rows_kept":43,"cut":false,"hidden":false,"merged":[[1,0,2,0],[1,1,2,1],[0,0,0,10]]}
[{"$f":"muni& \" - \"&S71F& \" - \"&date","v":"LIM355 Lepelle-Nkumpi - Table C7 Monthly Budget Statement - Cash Flow  - M08 February"}]
[{"$f":"desc","v":"Description"},{"$f":"head27","v":"Ref"},{"$f":"Head1","v":"2019/20"},{"$f":"Head2","v":"Budget Year 2020/21"}]
[null,null,{"$f":"Head5","v":"Audited Outcome"},{"$f":"Head6","v":"Original Budget"},{"$f":"Head7","v":"Adjusted Budget"},{"$f":"Head38","v":"Monthly actual"},{"$f":"Head39","v":"YearTD actual"},{"$f":"Head40","v":"YearTD budget"},{"$f":"Head41","v":"YTD variance"},{"$f":"Head41","v":"YTD variance"},{"$f":"Head8","v":"Full Year Forecast"}]
["R thousands",1,null,null,null,null,null,null,null,"%"]
["CASH FLOW FROM OPERATING ACTIVITIES"]
["Receipts"]
["Property rates",null,0,19223452,19223452,1101189.72,7225349.0999999996,12815632,{"$f":"G7-H7","v":-5590282.9000000004},{"$f":"IF(I7=0,\"\",I7/H7)","v":-0.43620813238082995},19223452]
["Service charges",null,0,2897004,2897004,3369941.52,19695845.739999998,1931336,17764509.739999998,{"$f":"IF(I8=0,\"\",I8/H8)","v":9.1980420496485333},2897004]
["Other revenue",null,0,456255885,456255885,10491473.35,469258280.72000003,304170568,165087712.72000003,{"$f":"IF(I9=0,\"\",I9/H9)","v":0.54274716257228417},456255885]
["Transfers and Subsidies - Operational",null,null,null,null,null,null,null,0,{"$f":"IF(I10=0,\"\",I10/H10)","v":""}]
["Transfers and Subsidies - Capital",null,null,null,null,null,null,null,0,{"$f":"IF(I11=0,\"\",I11/H11)","v":""}]
["Interest",null,0,7505491,7505491,0,3061328.73,5003656,-1942327.27,-0.38818161560267134,7505491]
["Dividends",null,0,0,0,0,0,0,0,"",0]
["Payments"]
["Suppliers and employees",null,0,-180073967,-180073967,5818826.75,-45484144.18,-120049296,{"$f":"H15-G15","v":-74565151.819999993},0.6211211086152475,-180073967]
["Finance charges",null,null,null,null,null,null,null,{"$f":"H16-G16","v":0},""]
["Transfers and Grants",null,null,null,null,null,null,null,{"$f":"H17-G17","v":0},""]
["NET CASH FROM/(USED) OPERATING ACTIVITIES",null,{"$f":"SUM(C7:C13)+SUM(C15:C17)","v":0},305807865,305807865,20781431.34,453756660.11000001,203871896,{"$f":"H18-G18","v":-249884764.11000001},-1.2256950026599056,{"$f":"SUM(K7:K13)+SUM(K15:K17)","v":305807865}]
[]
["CASH FLOWS FROM INVESTING ACTIVITIES"]
["Receipts"]
["Proceeds on disposal of PPE",null,null,null,null,null,null,null,{"$f":"G22-H22","v":0},{"$f":"IF(I22=0,\"\",I22/H22)","v":""}]
[]
["Decrease (increase) in non-current receivables",null,0,0,0,0,0,0,{"$f":"G24-H24","v":0},"",0]
["Decrease (increase) in non-current investments",null,0,0,0,0,150000000,0,{"$f":"G25-H25","v":150000000},{"$error":"#DIV/0!"},0]
["Payments"]
["Capital assets",null,0,-134668250,-134668250,-1777210.5,-22436038.920000002,-89778728,{"$f":"H27-G27","v":-67342689.079999998},0.75009627091174647,-134668250]
["NET CASH FROM/(USED) INVESTING ACTIVITIES",null,{"$f":"SUM(C22:C25)+C27","v":0},{"$f":"SUM(D22:D25)+D27","v":-134668250},-134668250,-1777210.5,127563961.08,-89778728,{"$f":"H28-G28","v":-217342689.07999998},2.4208706663787884,{"$f":"SUM(K22:K25)+K27","v":-134668250}]
[]
["CASH FLOWS FROM FINANCING ACTIVITIES"]
["Receipts"]
["Short term loans",null,null,null,null,null,null,null,{"$f":"G32-H32","v":0},{"$f":"IF(I32=0,\"\",I32/H32)","v":""}]
["Borrowing long term/refinancing",null,null,null,null,null,null,null,{"$f":"G33-H33","v":0},""]
["Increase (decrease) in consumer deposits",null,5000,-1891836,0,0,-2113252.13,-1257896,{"$f":"G34-H34","v":-855356.12999999989},0.67998954603560224,-1886836]
["Payments",null,null,null,null,null,null,null,null,""]
["Repayment of borrowing",null,0,0,0,0,0,0,{"$f":"H36-G36","v":0},"",0]
["NET CASH FROM/(USED) FINANCING ACTIVITIES",null,{"$f":"SUM(C32:C34)+C36","v":5000},-1891836,0,0,-2113252.13,-1257896,{"$f":"H37-G37","v":855356.12999999989},-0.67998954603560224,{"$f":"SUM(K32:K34)+K36","v":-1886836}]
[]
["NET INCREASE/ (DECREASE) IN CASH HELD",null,{"$f":"C18+C28+C37","v":5000},169247779,171139615,19004220.84,579207369.06000006,112835272,null,null,{"$f":"K18+K28+K37","v":169252779}]
["Cash/cash equivalents at beginning:",null,160,5430167,169597930,null,117948567.48999999]
["Cash/cash equivalents at month/year end:",null,{"$f":"C39+C40","v":5160},{"$f":"D39+D40","v":174677946},{"$f":"E39+E40","v":340737545},null,{"$f":"G39+G40","v":697155936.55000007},{"$f":"H39+H40","v":112835272},null,null,{"$f":"K39+K40","v":169252779}]
["References"]
["1. Material variances to be explained in Table SC1"]

{"sheet":"SC1","index":16,"n_rows":47,"n_cols":5,"rows_kept":47,"cut":false,"hidden":false,"merged":[[1,0,2,0],[1,1,2,1],[0,0,0,4]]}
[{"$f":"muni& \" - \"&S71G& \" - \"&date","v":"LIM355 Lepelle-Nkumpi - Supporting Table SC1 Material variance explanations  - M08 February"}]
[{"$f":"head27","v":"Ref"},{"$f":"desc","v":"Description"}]
[null,null,"Variance","Reasons for material deviations","Remedial or corrective steps/remarks"]
[null,"R thousands"]
[1,{"$f":"'C4-FinPerf RE'!A5","v":"Revenue By Source"}]
[null,"Client elected not to populate this sheet"]
[]
[]
[]
[2,{"$f":"'C4-FinPerf RE'!A24","v":"Expenditure By Type"}]
[null,"Client elected not to populate this sheet"]
[]
[]
[]
[3,{"$f":"RIGHT('C5-Capex'!A40,19)","v":"Capital Expenditure"}]
[null,"Client elected not to populate this sheet"]
[]
[]
[]
[4,"Financial Position"]
[null,"Client elected not to populate this sheet"]
[]
[]
[]
[5,"Cash Flow"]
[null,"Client elected not to populate this sheet"]
[]
[]
[]
[6,"Measureable performance"]
[null,"Client elected not to populate this sheet"]
[]
[]
[]
[7,"Municipal Entities"]
[null,"Client elected not to populate this sheet"]
[]
[]
[]
[]
[{"$f":"head27a","v":"References"}]
["1. Revenue for each source, vote and standard classification"]
["2. Expenditure for each type, vote and standard classification"]
["3. Capital expenditure for each vote and standard classification"]
["4. Explain any material variances between the annual budget and the expected financial position based on current trends"]
["5. Cash receipts by source and cash payments by type where not explained under revenue and expenditure"]
["6. For Sept, Dec, Mar and Jun statements explain any material variances in achievement of measurable performance objectives"]

{"sheet":"SC2","index":17,"n_rows":65,"n_cols":8,"rows_kept":65,"cut":false,"hidden":false,"merged":[[1,0,2,0],[1,1,2,1],[1,2,2,2],[0,0,0,7]]}
[{"$f":"muni& \" - \"&S71H& \" - \"&Head57","v":"LIM355 Lepelle-Nkumpi - Supporting Table SC2 Monthly Budget Statement - performance indicators   - M08 February"}]
["Description of financial indicator","Basis of calculation",{"$f":"head27","v":"Ref"},{"$f":"Head1","v":"2019/20"},{"$f":"Head2","v":"Budget Year 2020/21"}]
[null,null,null,{"$f":"Head5","v":"Audited Outcome"},{"$f":"Head6","v":"Original Budget"},{"$f":"Head7","v":"Adjusted Budget"},{"$f":"Head39","v":"YearTD actual"},{"$f":"Head8","v":"Full Year Forecast"}]
[]
["Borrowing Management"]
[]
["Capital Charges to Operating Expenditure","Interest & principal paid/Operating Expenditure",null,{"$f":"IF(ISERROR((D42-D43)/D45),0,((D42-D43)/D45))","v":0},{"$f":"IF(ISERROR((E42+E44)/E45),0,((E42+E44)/E45))","v":0.10458910371154773},{"$f":"IF(ISERROR((F42+F44)/F45),0,((F42+F44)/F45))","v":9.3260748813580083E-2},{"$f":"IF(ISERROR((G42+G44)/G45),0,((G42+G44)/G45))","v":0},{"$f":"IF(ISERROR((H42+H44)/H45),0,((H42+H44)/H45))","v":6.844545973442627E-2}]
["Borrowed funding of 'own' capital expenditure","Borrowings/Capital expenditure excl. transfers and grants",null,{"$f":"IF(ISERROR(D47/D46),0,(D47/D46))","v":0},{"$f":"IF(ISERROR(E47/E46),0,(E47/E46))","v":0},{"$f":"IF(ISERROR(F47/F46),0,(F47/F46))","v":0},{"$f":"IF(ISERROR(G47/G46),0,(G47/G46))","v":0},{"$f":"IF(ISERROR(H47/H46),0,(H47/H46))","v":0}]
["Safety of Capital"]
["Debt to Equity","Loans, Accounts Payable, Overdraft & Tax Provision/ Funds & Reserves",null,{"$f":"IF(ISERROR(D48/D49),0,(D48/D49))","v":-134.97919668430774},{"$f":"IF(ISERROR(E48/E49),0,(E48/E49))","v":7.5526635106813067E-2},{"$f":"IF(ISERROR(F48/F49),0,(F48/F49))","v":6.7182522681148424E-2},{"$f":"IF(ISERROR(G48/G49),0,(G48/G49))","v":0.10281393729708214},{"$f":"IF(ISERROR(H48/H49),0,(H48/H49))","v":6.7182522681148424E-2}]
["Gearing","Long Term Borrowing/ Funds & Reserves",null,{"$f":"IF(ISERROR(D51/D50),0,(D51/D50))","v":0},{"$f":"IF(ISERROR(E51/E50),0,(E51/E50))","v":0},{"$f":"IF(ISERROR(F51/F50),0,(F51/F50))","v":0},{"$f":"IF(ISERROR(G51/G50),0,(G51/G50))","v":1.863155553300969E-2},{"$f":"IF(ISERROR(H51/H50),0,(H51/H50))","v":0}]
["Liquidity"]
["Current Ratio","Current assets/current liabilities",1,{"$f":"IF(ISERROR(D52/D53),0,(D52/D53))","v":5.5900327378686026},{"$f":"IF(ISERROR(E52/E53),0,(E52/E53))","v":3.9213956229845022},{"$f":"IF(ISERROR(F52/F53),0,(F52/F53))","v":7.5655696043242209},{"$f":"IF(ISERROR(G52/G53),0,(G52/G53))","v":2.408563814369141},{"$f":"IF(ISERROR(H52/H53),0,(H52/H53))","v":7.5655696043242209}]
["Liquidity Ratio","Monetary Assets/Current Liabilities",null,{"$f":"IF(ISERROR(D54/D53),0,(D54/D53))","v":4.0782621189197945},{"$f":"IF(ISERROR(E54/E53),0,(E54/E53))","v":1.0544485916557402},{"$f":"IF(ISERROR(F54/F53),0,(F54/F53))","v":4.6986225729954594},{"$f":"IF(ISERROR(G54/G53),0,(G54/G53))","v":1.4690461531594576},{"$f":"IF(ISERROR(H54/H53),0,(H54/H53))","v":4.6986225729954594}]
["Revenue Management"]
["Annual Debtors Collection Rate \n(Payment Level %)","Last 12 Mths Receipts/ Last 12 Mths Billing"]
["Outstanding Debtors to Revenue","Total Outstanding Debtors to Annual Revenue",null,{"$f":"IF(ISERROR(D59/D55),0,(D59/D55))","v":0.19509930617311722},{"$f":"IF(ISERROR(E59/E55),0,(E59/E55))","v":0.21360579769385263},{"$f":"IF(ISERROR(F59/F55),0,(F59/F55))","v":0.18942440630837229},{"$f":"IF(ISERROR(G59/G55),0,(G59/G55))","v":0.31657116211941},{"$f":"IF(ISERROR(H59/H55),0,(H59/H55))","v":0.18942440630837229}]
["Longstanding Debtors Recovered","Debtors > 12 Mths Recovered/Total Debtors > \n12 Months Old",null,{"$f":"IF(ISERROR(D64/D63),0,(D64/D63))","v":0},{"$f":"IF(ISERROR(E64/E63),0,(E64/E63))","v":0},{"$f":"IF(ISERROR(F64/F63),0,(F64/F63))","v":0},{"$f":"IF(ISERROR(G64/G63),0,(G64/G63))","v":0},{"$f":"IF(ISERROR(H64/H63),0,(H64/H63))","v":0}]
["Creditors Management"]
["Creditors System Efficiency","% of Creditors Paid Within Terms (within MFMA s 65(e))"]
["Funding of Provisions"]
["Percentage Of Provisions Not Funded","Unfunded Provisions/Total Provisions"]
["Other Indicators"]
["Electricity Distribution Losses","% Volume (units purchased and generated less units sold)/units purchased and generated",2]
["Water Distribution Losses","% Volume (units purchased and own source less units sold)/Total units purchased and own source",2]
["Employee costs","Employee costs/Total Revenue - capital revenue",null,{"$f":"IF(ISERROR(D40/D55),0,(D40/D55))","v":0.18112307582881124},{"$f":"IF(ISERROR(E40/E55),0,(E40/E55))","v":0.30160742230625243},{"$f":"IF(ISERROR(F40/F55),0,(F40/F55))","v":0.25827900779823587},{"$f":"IF(ISERROR(G40/G55),0,(G40/G55))","v":0.17595113166128373},{"$f":"IF(ISERROR(H40/H55),0,(H40/H55))","v":0.25827900779823587}]
["Repairs & Maintenance","R&M/Total Revenue - capital revenue",null,{"$f":"IF(ISERROR(D41/D55),0,(D41/D55))","v":3.6202311512738834E-3},{"$f":"IF(ISERROR(E41/E55),0,(E41/E55))","v":8.4452083087020093E-3},{"$f":"IF(ISERROR(F41/F55),0,(F41/F55))","v":3.2441529967944638E-2},{"$f":"IF(ISERROR(G41/G55),0,(G41/G55))","v":1.067567358115112E-3},{"$f":"IF(ISERROR(H41/H55),0,(H41/H55))","v":3.2441529967944638E-2}]
["Interest & Depreciation","I&D/Total Revenue - capital revenue",null,{"$f":"IF(ISERROR((D42+D44)/D55),0,((D42+D44)/D55))","v":9.4853031241231845E-5},{"$f":"IF(ISERROR((E42+E44)/E55),0,((E42+E44)/E55))","v":8.2922525345458478E-2},{"$f":"IF(ISERROR((F42+F44)/F55),0,((F42+F44)/F55))","v":7.3535223775466244E-2},{"$f":"IF(ISERROR((G42+G44)/G55),0,((G42+G44)/G55))","v":0},{"$f":"IF(ISERROR((H42+H44)/H55),0,((H42+H44)/H55))","v":5.3968601603730661E-2}]
["IDP regulation financial viability indicators"]
["i. Debt coverage","(Total Operating Revenue - Operating Grants)/Debt service payments due within financial year)"]
["ii. O/S Service Debtors to Revenue","Total outstanding service debtors/annual revenue received for services"]
["iii. Cost coverage","(Available cash + Investments)/monthly fixed operational expenditure"]
["References"]
["1. Consumer debtors > 12 months old are excluded from current assets."]
["2. Material variances to be explained."]
[]
["Calculations"]
[{"$f":"'C6-FinPos'!A38","v":"Borrowing"},null,null,{"$f":"'C6-FinPos'!C38","v":0},{"$f":"'C6-FinPos'!D38","v":0},{"$f":"'C6-FinPos'!E38","v":0},{"$f":"'C6-FinPos'!F38","v":238138.31},0]
["Total Assets",null,null,{"$f":"'C6-FinPos'!C26","v":118401676.90000001},{"$f":"'C6-FinPos'!D26","v":1108456534},{"$f":"'C6-FinPos'!E26","v":1390252233},{"$f":"'C6-FinPos'!F26","v":1460065274.6799998},{"$f":"'C6-FinPos'!G26","v":1390252233}]
[{"$f":"'C4-FinPerf RE'!A25","v":"Employee related costs"},null,null,{"$f":"'C4-FinPerf RE'!C25","v":25927135.449999999},{"$f":"'C4-FinPerf RE'!D25","v":117854345},{"$f":"'C4-FinPerf RE'!E25","v":113807212},{"$f":"'C4-FinPerf RE'!G25","v":64747073.219999999},{"$f":"'C4-FinPerf RE'!K25","v":113807212}]
[{"$f":"A27","v":"Repairs & Maintenance"},null,null,518223.44,3300000,14294929,392846.93,14294929]
["Interest (finance charges)",null,null,{"$f":"'C4-FinPerf RE'!C29","v":0},{"$f":"'C4-FinPerf RE'!D29","v":141075},{"$f":"'C4-FinPerf RE'!E29","v":141075},{"$f":"'C4-FinPerf RE'!G29","v":0},{"$f":"'C4-FinPerf RE'!K29","v":141075}]
["Principal paid",null,null,{"$f":"-'C7-CFlow'!C36","v":0},{"$f":"-'C7-CFlow'!D36","v":0},{"$f":"-'C7-CFlow'!E36","v":0},{"$f":"-'C7-CFlow'!G36","v":0},{"$f":"-'C7-CFlow'!K36","v":0}]
["Depreciation",null,null,{"$f":"'C4-FinPerf RE'!C28","v":13577.88},{"$f":"'C4-FinPerf RE'!D28","v":32261244},{"$f":"'C4-FinPerf RE'!E28","v":32261244},null,{"$f":"'C4-FinPerf RE'!K26","v":23639472}]
["Operating expenditure",null,null,{"$f":"'C4-FinPerf RE'!C36","v":47307824.539999999},{"$f":"'C4-FinPerf RE'!D36","v":309805877},{"$f":"'C4-FinPerf RE'!E36","v":347437903},{"$f":"'C4-FinPerf RE'!G36","v":155980915.64999998},{"$f":"'C4-FinPerf RE'!K36","v":347437903}]
[{"$f":"'C5-Capex'!A40","v":"Total Capital Expenditure"},null,null,{"$f":"'C5-Capex'!C40","v":13767567.819999998},{"$f":"'C5-Capex'!D40","v":134668250},{"$f":"'C5-Capex'!E40","v":164519790},{"$f":"'C5-Capex'!G40","v":22436038.920000002},{"$f":"'C5-Capex'!K40","v":164519790}]
["Borrowed funding for capital",null,null,{"$f":"'C5-Capex'!C72","v":0},{"$f":"'C5-Capex'!D72","v":0},{"$f":"'C5-Capex'!E72","v":0},{"$f":"'C5-Capex'!G72","v":0},{"$f":"'C5-Capex'!K72","v":0}]
["Debt",null,null,{"$f":"'C6-FinPos'!C30+'C6-FinPos'!C31+'C6-FinPos'!C33+'C6-FinPos'!C38","v":18722977.869999997},{"$f":"'C6-FinPos'!D30+'C6-FinPos'!D31+'C6-FinPos'!D33+'C6-FinPos'!D38","v":67249314},{"$f":"'C6-FinPos'!E30+'C6-FinPos'!E31+'C6-FinPos'!E33+'C6-FinPos'!E38","v":67249314},{"$f":"'C6-FinPos'!F30+'C6-FinPos'!F31+'C6-FinPos'!F33+'C6-FinPos'!F38","v":147525496.95000002},{"$f":"'C6-FinPos'!G30+'C6-FinPos'!G31+'C6-FinPos'!G33+'C6-FinPos'!G38","v":67249314}]
["Equity",null,null,{"$f":"'C6-FinPos'!C48","v":-138710.1},{"$f":"'C6-FinPos'!D48","v":890405271},{"$f":"'C6-FinPos'!E48","v":1000994177},{"$f":"'C6-FinPos'!F48","v":1434878391.28},{"$f":"'C6-FinPos'!G48","v":1000994177}]
[{"$f":"'C6-FinPos'!A47","v":"Reserves"},null,null,{"$f":"'C6-FinPos'!C47","v":0},{"$f":"'C6-FinPos'!D47","v":0},{"$f":"'C6-FinPos'!E47","v":0},{"$f":"'C6-FinPos'!F47","v":12781450.779999999},{"$f":"'C6-FinPos'!G47","v":0}]
[{"$f":"'C6-FinPos'!A38","v":"Borrowing"},null,null,{"$f":"'C6-FinPos'!C38","v":0},{"$f":"'C6-FinPos'!D38","v":0},{"$f":"'C6-FinPos'!E38","v":0},{"$f":"'C6-FinPos'!F38","v":238138.31},{"$f":"'C6-FinPos'!G38","v":0}]
[{"$f":"'C6-FinPos'!A6","v":"Current assets"},null,null,{"$f":"'C6-FinPos'!C13","v":104634109.08},{"$f":"'C6-FinPos'!D13","v":271110196},{"$f":"'C6-FinPos'!E13","v":523054355},{"$f":"'C6-FinPos'!F13","v":408402932.02999997},{"$f":"'C6-FinPos'!G13","v":523054355}]
[{"$f":"'C6-FinPos'!A29","v":"Current liabilities"},null,null,{"$f":"'C6-FinPos'!C35","v":18717977.869999997},{"$f":"'C6-FinPos'!D35","v":69136150},{"$f":"'C6-FinPos'!E35","v":69136150},{"$f":"'C6-FinPos'!F35","v":169562844.71000001},{"$f":"'C6-FinPos'!G35","v":69136150}]
["Monetary assets",null,null,{"$f":"'C6-FinPos'!C7+'C6-FinPos'!C8","v":76336820.090000004},{"$f":"'C6-FinPos'!D7+'C6-FinPos'!D8","v":72900516},{"$f":"'C6-FinPos'!E7+'C6-FinPos'!E8","v":324844675},{"$f":"'C6-FinPos'!F7+'C6-FinPos'!F8","v":249095644.74000001},{"$f":"'C6-FinPos'!G7+'C6-FinPos'!G8","v":324844675}]
[{"$f":"'C4-FinPerf RE'!A22","v":"Total Revenue (excluding capital transfers and contributions)"},null,null,{"$f":"'C4-FinPerf RE'!C22","v":143146505.94},{"$f":"'C4-FinPerf RE'!D22","v":390754127},{"$f":"'C4-FinPerf RE'!E22","v":440636709},{"$f":"'C4-FinPerf RE'!G22","v":367983272.45000005},{"$f":"'C4-FinPerf RE'!K22","v":440636709}]
[{"$f":"'C4-FinPerf RE'!A19","v":"Transfers and subsidies"},null,null,{"$f":"'C4-FinPerf RE'!C19","v":105855612.68000001},{"$f":"'C4-FinPerf RE'!D19","v":269853000},{"$f":"'C4-FinPerf RE'!E19","v":323118898},{"$f":"'C4-FinPerf RE'!G19","v":254225195.38},{"$f":"'C4-FinPerf RE'!K19","v":323118898}]
[{"$f":"'C4-FinPerf RE'!A39","v":"Transfers and subsidies - capital (monetary allocations) (National / Provincial and District)"},null,null,{"$f":"'C4-FinPerf RE'!C39","v":3983727.73},{"$f":"'C4-FinPerf RE'!D39","v":53720000},{"$f":"'C4-FinPerf RE'!E39","v":69887541},{"$f":"'C4-FinPerf RE'!G39","v":12341792.029999999},{"$f":"'C4-FinPerf RE'!K39","v":69887541}]
["Debt service payments",null,null,{"$f":"'C7-CFlow'!C12+'C7-CFlow'!C36","v":0},{"$f":"'C7-CFlow'!D12+'C7-CFlow'!D36","v":7505491},{"$f":"'C7-CFlow'!E12+'C7-CFlow'!E36","v":7505491},{"$f":"'C7-CFlow'!G16+'C7-CFlow'!G36","v":0},{"$f":"'C7-CFlow'!K16+'C7-CFlow'!K36","v":0}]
["Outstanding debtors (receivables)",null,null,{"$f":"'C6-FinPos'!C9+'C6-FinPos'!C10+'C6-FinPos'!C11+'C6-FinPos'!C16","v":27927783.990000002},{"$f":"'C6-FinPos'!D9+'C6-FinPos'!D10+'C6-FinPos'!D11+'C6-FinPos'!D16","v":83467347},{"$f":"'C6-FinPos'!E9+'C6-FinPos'!E10+'C6-FinPos'!E11+'C6-FinPos'!E16","v":83467347},{"$f":"'C6-FinPos'!F9+'C6-FinPos'!F10+'C6-FinPos'!F11+'C6-FinPos'!F16","v":116492892.19999999},{"$f":"'C6-FinPos'!G9+'C6-FinPos'!G10+'C6-FinPos'!G11+'C6-FinPos'!G16","v":83467347}]
["Annual services revenue",null,null,{"$f":"SUM('C4-FinPerf RE'!C7:C11)","v":23065489.82},{"$f":"SUM('C4-FinPerf RE'!D7:D11)","v":6271577},{"$f":"SUM('C4-FinPerf RE'!E7:E11)","v":6539437},{"$f":"SUM('C4-FinPerf RE'!G7:G11)","v":51507892.950000003}]
["Cash + investments","Including LT investments",null,{"$f":"'C6-FinPos'!C7+'C6-FinPos'!C8+'C6-FinPos'!C17-'C6-FinPos'!C30","v":76336820.090000004},{"$f":"'C6-FinPos'!D7+'C6-FinPos'!D8+'C6-FinPos'!D17-'C6-FinPos'!D30","v":72900516},{"$f":"'C6-FinPos'!E7+'C6-FinPos'!E8+'C6-FinPos'!E17-'C6-FinPos'!E30","v":324844675},{"$f":"'C6-FinPos'!F7+'C6-FinPos'!F8+'C6-FinPos'!F17-'C6-FinPos'!F30","v":399095644.74000001},{"$f":"'C6-FinPos'!G7+'C6-FinPos'!G8+'C6-FinPos'!G17-'C6-FinPos'!G30","v":324844675}]
["Fixed operational expend. (monthly)"]
["Longstanding debtors outstanding",null,null,{"$f":"'C6-FinPos'!C16","v":0},{"$f":"'C6-FinPos'!D16","v":0},{"$f":"'C6-FinPos'!E16","v":0},{"$f":"'C6-FinPos'!F16","v":0},{"$f":"'C6-FinPos'!G16","v":0}]
["Longstanding debtors recovered"]
["Attorney collections"]

{"sheet":"SC3","index":18,"n_rows":27,"n_cols":14,"rows_kept":27,"cut":false,"hidden":false,"merged":[[0,0,0,12],[1,2,1,13]]}
[{"$f":"muni& \" - \"&S71I& \" - \"&Head57","v":"LIM355 Lepelle-Nkumpi - Supporting Table SC3 Monthly Budget Statement - aged debtors - M08 February"}]
[{"$f":"desc","v":"Description"},null,{"$f":"Head2","v":"Budget Year 2020/21"}]
["R thousands","NT Code","0-30 Days","31-60 Days","61-90 Days","91-120 Days","121-150 Dys","151-180 Dys","181 Dys-1 Yr","Over 1Yr","Total","Total \nover 90 days","Actual Bad Debts Written Off against Debtors","Impairment - Bad Debts i.t.o Council Policy"]
["Debtors Age Analysis By Income Source"]
["Trade and Other Receivables from Exchange Transactions - Water",1200,null,null,null,null,null,null,null,null,{"$f":"SUM(C5:J5)","v":0},{"$f":"SUM(F5:J5)","v":0}]
["Trade and Other Receivables from Exchange Transactions - Electricity",1300,null,null,null,null,null,null,null,null,{"$f":"SUM(C6:J6)","v":0},{"$f":"SUM(F6:J6)","v":0}]
["Receivables from Non-exchange Transactions - Property Rates",1400,null,null,null,null,null,null,null,null,{"$f":"SUM(C7:J7)","v":0},0]
["Receivables from Exchange Transactions - Waste Water Management",1500,null,null,null,null,null,null,null,null,0,0]
["Receivables from Exchange Transactions - Waste Management",1600,null,null,null,null,null,null,null,null,0,{"$f":"SUM(F9:J9)","v":0}]
["Receivables from Exchange Transactions - Property Rental Debtors",1700,null,null,null,null,null,null,null,null,0,{"$f":"SUM(F10:J10)","v":0}]
["Interest on Arrear Debtor Accounts",1810,null,null,null,null,null,null,null,null,0,0]
["Recoverable unauthorised, irregular, fruitless and wasteful expenditure",1820,null,null,null,null,null,null,null,null,0,0]
["Other",1900,null,null,null,null,null,null,null,null,0,{"$f":"SUM(F13:J13)","v":0}]
["Total By Income Source",2000,{"$f":"SUM(C5:C13)","v":0},0,0,0,0,0,0,0,0,{"$f":"SUM(L5:L13)","v":0},0,0]
[{"$f":"Head1&\" - totals only\"","v":"2019/20 - totals only"},null,null,null,null,null,null,null,null,null,{"$f":"SUM(C15:J15)","v":0},{"$f":"SUM(F15:J15)","v":0}]
["Debtors Age Analysis By Customer Group"]
["Organs of State",2200,null,null,null,null,null,null,null,null,{"$f":"SUM(C17:J17)","v":0},{"$f":"SUM(F17:J17)","v":0}]
["Commercial",2300,null,null,null,null,null,null,null,null,{"$f":"SUM(C18:J18)","v":0},{"$f":"SUM(F18:J18)","v":0}]
["Households",2400,null,null,null,null,null,null,null,null,{"$f":"SUM(C19:J19)","v":0},{"$f":"SUM(F19:J19)","v":0}]
["Other",2500,null,null,null,null,null,null,null,null,{"$f":"SUM(C20:J20)","v":0},{"$f":"SUM(F20:J20)","v":0}]
["Total By Customer Group",2600,{"$f":"SUM(C17:C20)","v":0},0,0,0,0,0,0,{"$f":"SUM(J17:J20)","v":0},{"$f":"SUM(K17:K20)","v":0},{"$f":"SUM(L17:L20)","v":0},{"$f":"SUM(M17:M20)","v":0},{"$f":"SUM(N17:N20)","v":0}]
["Notes"]
["Material increases in value of debtors' categories compared to previous month to be explained"]
["Bad debts = amounts actually written off in the month"]
["Total by Income Source must reconcile with Total by Customer Group"]
[null,null,{"$f":"C14-C21","v":0},{"$f":"D14-D21","v":0},{"$f":"E14-E21","v":0},0,0,0,0,{"$f":"J14-J21","v":0},0]
[null,null,{"$f":"IF(C26=0,\"\",\"MUST AGREE\")","v":""},{"$f":"IF(D26=0,\"\",\"MUST AGREE\")","v":""},"","","","","","",""]

{"sheet":"SC4","index":19,"n_rows":17,"n_cols":12,"rows_kept":17,"cut":false,"hidden":false,"merged":[[1,11,3,11],[0,0,0,10],[2,8,3,8],[2,9,3,9],[2,10,3,10],[2,4,3,4],[2,5,3,5],[2,6,3,6],[2,7,3,7],[1,0,2,0],[1,1,3,1],[2,2,3,2],[2,3,3,3]]}
[{"$f":"muni& \" - \"&S71J& \" - \"&Head57","v":"LIM355 Lepelle-Nkumpi - Supporting Table SC4 Monthly Budget Statement - aged creditors  - M08 February"}]
[{"$f":"desc","v":"Description"},"NT Code",{"$f":"Head2","v":"Budget Year 2020/21"},null,null,null,null,null,null,null,null,"Prior year totals for chart (same period)"]
[null,null,"0 - \n30 Days","31 - \n60 Days","61 - \n90 Days","91 - \n120 Days","121 - \n150 Days","151 - \n180 Days","181 Days -\n1 Year","Over 1\nYear","Total\n"]
["R thousands"]
["Creditors Age Analysis By Customer Type"]
["Bulk Electricity","0100",null,null,null,null,null,null,null,null,{"$f":"SUM(C6:J6)","v":0}]
["Bulk Water","0200",null,null,null,null,null,null,null,null,{"$f":"SUM(C7:J7)","v":0}]
["PAYE deductions","0300",null,null,null,null,null,null,null,null,0]
["VAT (output less input)","0400",null,null,null,null,null,null,null,null,0]
["Pensions / Retirement deductions","0500",null,null,null,null,null,null,null,null,0]
["Loan repayments","0600",null,null,null,null,null,null,null,null,0]
["Trade Creditors","0700",null,null,null,null,null,null,null,null,0]
["Auditor General","0800",null,null,null,null,null,null,null,null,0]
["Other","0900",null,null,null,null,null,null,null,null,{"$f":"SUM(C14:J14)","v":0}]
["Total By Customer Type",1000,{"$f":"SUM(C6:C14)","v":0},{"$f":"SUM(D6:D14)","v":0},0,0,0,0,0,0,{"$f":"SUM(K6:K14)","v":0},{"$f":"SUM(L6:L14)","v":0}]
["Notes"]
["Material increases in value of creditors' categories compared to previous month to be explained"]

{"sheet":"SC5","index":20,"n_rows":22,"n_cols":15,"rows_kept":22,"cut":false,"hidden":false,"merged":[[2,10,2,14],[0,0,0,9],[1,1,2,1],[1,3,2,3],[1,9,2,9]]}
[{"$f":"muni& \" - \"&S71K& \" - \"&Head57","v":"LIM355 Lepelle-Nkumpi - Supporting Table SC5 Monthly Budget Statement - investment portfolio  - M08 February"}]
["Investments by maturity\nName of institution & investment ID","Ref","Period of Investment","Type of Investment","Capital Guarantee\n(Yes/ No)","Variable or Fixed interest rate","Interest Rate ᶟ","Commission Paid (Rands)","Commission Recipient","Expiry date of investment","Opening balance","Interest to be realised","Partial / Premature Withdrawal (4)","Investment Top Up","Closing Balance"]
["R thousands",null,"Yrs/Months"]
["Municipality"]
[null,null,null,null,null,null,null,null,null,null,null,null,null,null,{"$f":"SUM(K5:N5)","v":0}]
["Municipality sub-total",null,null,null,null,null,null,null,null,null,{"$f":"SUM(K5:K5)","v":0},null,{"$f":"SUM(M5:M5)","v":0},{"$f":"SUM(N5:N5)","v":0},{"$f":"SUM(O5:O5)","v":0}]
[]
["Entities"]
[null,null,null,null,null,null,null,null,null,null,null,null,null,null,{"$f":"SUM(K9:N9)","v":0}]
[null,null,null,null,null,null,null,null,null,null,null,null,null,null,0]
[null,null,null,null,null,null,null,null,null,null,null,null,null,null,0]
[null,null,null,null,null,null,null,null,null,null,null,null,null,null,0]
[null,null,null,null,null,null,null,null,null,null,null,null,null,null,0]
[null,null,null,null,null,null,null,null,null,null,null,null,null,null,0]
[null,null,null,null,null,null,null,null,null,null,null,null,null,null,0]
["Entities sub-total",null,null,null,null,null,null,null,null,null,{"$f":"SUM(K9:K15)","v":0},null,{"$f":"SUM(M9:M15)","v":0},{"$f":"SUM(N9:N15)","v":0},{"$f":"SUM(O9:O15)","v":0}]
[]
["TOTAL INVESTMENTS AND INTEREST",2,null,null,null,null,null,null,null,null,{"$f":"K6+K16","v":0},null,{"$f":"M6+M16","v":0},{"$f":"N6+N16","v":0},{"$f":"O6+O16","v":0}]
[{"$f":"head27a","v":"References"}]
["2. List investments in expiry date order"]
["3. If 'variable' is selected in column F, input interest rate range"]
["4. Withdrawals to be entered as negative"]

{"sheet":"SC6","index":21,"n_rows":42,"n_cols":11,"rows_kept":42,"cut":false,"hidden":false,"merged":[[1,0,2,0],[1,1,2,1],[0,0,0,10]]}
[{"$f":"muni& \" - \"&S71L& \" - \"&Head57","v":"LIM355 Lepelle-Nkumpi - Supporting Table SC6 Monthly Budget Statement - transfers and grant receipts  - M08 February"}]
[{"$f":"desc","v":"Description"},{"$f":"head27","v":"Ref"},{"$f":"Head1","v":"2019/20"},{"$f":"Head2","v":"Budget Year 2020/21"}]
[null,null,{"$f":"Head5","v":"Audited Outcome"},{"$f":"Head6","v":"Original Budget"},{"$f":"Head7","v":"Adjusted Budget"},{"$f":"Head38","v":"Monthly actual"},{"$f":"Head39","v":"YearTD actual"},{"$f":"Head40","v":"YearTD budget"},{"$f":"Head41","v":"YTD variance"},{"$f":"Head41","v":"YTD variance"},{"$f":"Head8","v":"Full Year Forecast"}]
["R thousands",null,null,null,null,null,null,null,null,"%"]
["RECEIPTS:","1,2"]
[]
["Operating Transfers and Grants"]
["National Government:",null,{"$f":"SUM(C9:C13)","v":105855612.68000001},269853000,322419000,851175.27,254225195.38,211441600,{"$f":"G8-H8","v":42783595.379999995},{"$f":"IF(H8=0,\"\",I8/H8)","v":0.20234237434828339},{"$f":"SUM(K9:K13)","v":322419000}]
["Equitable Share",null,104184000,265947000,318513000,0,251860000,208837600,43022400,0.20600887962704034,318513000]
["Expanded Public Works Programme Integrated Grant",null,1192935,1906000,1906000,589890,858390,1270664,-412274,-0.32445556024251887,1906000]
["Integrated National Electrification Programme Grant",null,0,0,0,0,0,0,0,"",0]
["Local Government Financial Management Grant",null,478677.68,2000000,2000000,261285.27,1506805.38,1333336,173469.37999999989,0.13010177479645033,2000000]
["Municipal Disaster Relief Grant",null,0,0,0,0,0,0,0,"",0]
["Other transfers and grants [insert description]",null,null,null,null,null,null,null,{"$f":"G14-H14","v":0},{"$f":"IF(I14=0,\"\",I14/H14)","v":""}]
["Provincial Government:",null,{"$f":"SUM(C16:C16)","v":0},0,699898,0,0,139979,{"$f":"G15-H15","v":-139979},{"$f":"IF(H15=0,\"\",I15/H15)","v":-1},{"$f":"SUM(K16:K16)","v":699898}]
["Specify (Add grant description)",null,0,0,699898,0,0,139979,{"$f":"G16-H16","v":-139979},{"$f":"IF(H16=0,\"\",I16/H16)","v":-1},699898]
["Other transfers and grants [insert description]",null,null,null,null,null,null,null,{"$f":"G17-H17","v":0},""]
["District Municipality:",null,{"$f":"SUM(C19:C19)","v":0},0,0,0,0,0,0,"",{"$f":"SUM(K19:K19)","v":0}]
["[insert description]",null,null,null,null,null,null,null,0,""]
["Other grant providers:",null,{"$f":"SUM(C21:C22)","v":0},0,0,0,0,0,{"$f":"G20-H20","v":0},{"$f":"IF(H20=0,\"\",I20/H20)","v":""},{"$f":"SUM(K21:K22)","v":0}]
["Library Donations",null,0,0,0,0,0,0,{"$f":"G21-H21","v":0},{"$f":"IF(H21=0,\"\",I21/H21)","v":""},0]
["Local Government  Water and Related Service SETA",null,0,0,0,0,0,0,{"$f":"G22-H22","v":0},{"$f":"IF(H22=0,\"\",I22/H22)","v":""},0]
["Total Operating Transfers and Grants",5,{"$f":"C8+C15+C18+C20","v":105855612.68000001},269853000,323118898,851175.27,254225195.38,211581579,42643616.379999995,0.20154692379907041,{"$f":"K8+K15+K18+K20","v":323118898}]
[]
["Capital Transfers and Grants"]
[{"$f":"A8","v":"National Government:"},null,{"$f":"SUM(C27:C27)","v":3983727.73},53720000,69887541,5500363.5899999999,12341792.029999999,39046844,{"$f":"G26-H26","v":-26705051.969999999},{"$f":"IF(H26=0,\"\",I26/H26)","v":-0.68392344257067228},{"$f":"SUM(K27:K27)","v":69887541}]
["Municipal Infrastructure Grant ",null,3983727.73,53720000,69887541,5500363.5899999999,12341792.029999999,39046844,{"$f":"G27-H27","v":-26705051.969999999},{"$f":"IF(H27=0,\"\",I27/H27)","v":-0.68392344257067228},69887541]
[{"$f":"A15","v":"Provincial Government:"},null,{"$f":"SUM(C29:C29)","v":0},0,0,0,0,0,{"$f":"G28-H28","v":0},{"$f":"IF(H28=0,\"\",I28/H28)","v":""},{"$f":"SUM(K29:K29)","v":0}]
["Specify (Add grant description)",null,0,0,0,0,0,0,{"$f":"G29-H29","v":0},{"$f":"IF(H29=0,\"\",I29/H29)","v":""},0]
[{"$f":"A18","v":"District Municipality:"},null,{"$f":"SUM(C31:C31)","v":0},0,0,0,0,0,{"$f":"G30-H30","v":0},{"$f":"IF(I30=0,\"\",I30/H30)","v":""},{"$f":"SUM(K31:K31)","v":0}]
["[insert description]",null,null,null,null,null,null,null,0,""]
[{"$f":"A20","v":"Other grant providers:"},null,{"$f":"SUM(C33:C33)","v":0},0,0,0,0,0,0,"",{"$f":"SUM(K33:K33)","v":0}]
["[insert description]",null,null,null,null,null,null,null,0,{"$f":"IF(I33=0,\"\",I33/H33)","v":""}]
["Total Capital Transfers and Grants",5,{"$f":"C26+C28+C30+C32","v":3983727.73},53720000,69887541,5500363.5899999999,12341792.029999999,39046844,-26705051.969999999,-0.68392344257067228,{"$f":"K26+K28+K30+K32","v":69887541}]
[]
["TOTAL RECEIPTS OF TRANSFERS & GRANTS",5,{"$f":"C23+C34","v":109839340.41000001},323573000,393006439,6351538.8599999994,266566987.41,250628423,15938564.409999996,6.3594400903204812E-2,{"$f":"K23+K34","v":393006439}]
[{"$f":"head27a","v":"References"}]
["1. Each grant is listed by name as gazetted together with the name of the transferring department or municipality, donor or other organisation"]
["2. Grant expenditure must be separately listed for each grant received"]
["3. Replacement of RSC levies"]
["4. Housing subsidies for housing where ownership transferred"]
["5. Total recurrent/capital grants and subsidies must reconcile to the 'Financial Performance' Statement"]

{"sheet":"SC7(1)","index":22,"n_rows":36,"n_cols":11,"rows_kept":36,"cut":false,"hidden":false,"merged":[[1,0,2,0],[1,1,2,1],[0,0,0,10]]}
[{"$f":"muni& \" - \"&S71M& \" - \"&Head57","v":"LIM355 Lepelle-Nkumpi - Supporting Table SC7(1) Monthly Budget Statement - transfers and grant expenditure  - M08 February"}]
[{"$f":"desc","v":"Description"},{"$f":"head27","v":"Ref"},{"$f":"Head1","v":"2019/20"},{"$f":"Head2","v":"Budget Year 2020/21"}]
[null,null,{"$f":"Head5","v":"Audited Outcome"},{"$f":"Head6","v":"Original Budget"},{"$f":"Head7","v":"Adjusted Budget"},{"$f":"Head38","v":"Monthly actual"},{"$f":"Head39","v":"YearTD actual"},{"$f":"Head40","v":"YearTD budget"},{"$f":"Head41","v":"YTD variance"},{"$f":"Head41","v":"YTD variance"},{"$f":"Head8","v":"Full Year Forecast"}]
["R thousands",null,null,null,null,null,null,null,null,"%"]
["EXPENDITURE"]
[]
["Operating expenditure of Transfers and Grants"]
[{"$f":"'SC6'!A8","v":"National Government:"},null,{"$f":"SUM(C9:C14)","v":45433656.060000002},308756877,328408451,16555093.07,155132101.12,216293766,-61161664.880000003,{"$f":"IF(I8=0,\"\",I8/H8)","v":-0.28277127913154926},{"$f":"SUM(K9:K14)","v":328408451}]
[null,null,null,null,null,null,null,null,{"$f":"G9-H9","v":0},""]
["Equitable Share",null,45333040.609999999,294899127,322262983,15409781.09,151536213.41,211517718,{"$f":"G10-H10","v":-59981504.590000004},{"$f":"IF(H10=0,\"\",I10/H10)","v":-0.2835767384271799},322262983]
["Expanded Public Works Programme Integrated Grant",null,0,1906000,1906000,552087,901589,1270664,{"$f":"G11-H11","v":-369075},{"$f":"IF(H11=0,\"\",I11/H11)","v":-0.29045837451914902},1906000]
["Integrated National Electrification Programme Grant",null,0,7300000,0,0,0,486664,{"$f":"G12-H12","v":-486664},{"$f":"IF(H12=0,\"\",I12/H12)","v":-1},0]
["Local Government Financial Management Grant",null,88636.32,2000000,2000001,408333.25,1410751.83,1333344,{"$f":"G13-H13","v":77407.830000000075},{"$f":"IF(H13=0,\"\",I13/H13)","v":5.8055408056735605E-2},2000001]
["Municipal Infrastructure Grant",null,11979.13,2651750,2239467,184891.73,1283546.8799999999,1685376,{"$f":"G14-H14","v":-401829.12000000011},{"$f":"IF(H14=0,\"\",I14/H14)","v":-0.23842105263157901},2239467]
[{"$f":"'SC6'!A15","v":"Provincial Government:"},null,{"$f":"SUM(C16:C17)","v":0},0,683443,0,0,136688,-136688,-1,{"$f":"SUM(K16:K17)","v":683443}]
[null,null,null,null,null,null,null,null,{"$f":"G16-H16","v":0},""]
["Specify (Add grant description)",null,0,0,683443,0,0,136688,{"$f":"G17-H17","v":-136688},{"$f":"IF(H17=0,\"\",I17/H17)","v":-1},683443]
[{"$f":"'SC6'!A18","v":"District Municipality:"},null,{"$f":"SUM(C19:C19)","v":0},0,0,0,0,0,0,"",{"$f":"SUM(K19:K19)","v":0}]
[null,null,null,null,null,null,null,null,0,""]
[{"$f":"'SC6'!A20","v":"Other grant providers:"},null,{"$f":"SUM(C21:C21)","v":0},0,0,0,0,0,0,"",{"$f":"SUM(K21:K21)","v":0}]
[null,null,null,null,null,null,null,null,0,""]
["Total operating expenditure of Transfers and Grants:",null,{"$f":"C8+C15+C18+C20","v":45433656.060000002},308756877,329091894,16555093.07,155132101.12,216430454,-61298352.880000003,-0.28322424939329471,{"$f":"K8+K15+K18+K20","v":329091894}]
[]
["Capital expenditure of Transfers and Grants"]
[{"$f":"'SC6'!A26","v":"National Government:"},null,{"$f":"SUM(C26:C26)","v":8736597.3699999992},54318250,67648073,3494138.8,9884046.3499999996,37578140,-27694093.649999999,{"$f":"IF(I25=0,\"\",I25/H25)","v":-0.73697350773614656},{"$f":"SUM(K26:K26)","v":67648073}]
["Municipal Infrastructure Grant ",null,8736597.3699999992,54318250,67648073,3494138.8,9884046.3499999996,37578140,{"$f":"G26-H26","v":-27694093.649999999},{"$f":"IF(H26=0,\"\",I26/H26)","v":-0.73697350773614656},67648073]
[{"$f":"'SC6'!A28","v":"Provincial Government:"},null,{"$f":"SUM(C28:C28)","v":0},0,0,0,0,0,{"$f":"G27-H27","v":0},"",{"$f":"SUM(K28:K28)","v":0}]
["Specify (Add grant description)",null,0,0,0,0,0,0,{"$f":"G28-H28","v":0},{"$f":"IF(H28=0,\"\",I28/H28)","v":""},0]
[{"$f":"'SC6'!A30","v":"District Municipality:"},null,{"$f":"SUM(C30:C30)","v":0},0,0,0,0,0,0,"",{"$f":"SUM(K30:K30)","v":0}]
[null,null,null,null,null,null,null,null,0,""]
[{"$f":"'SC6'!A32","v":"Other grant providers:"},null,{"$f":"SUM(C32:C32)","v":0},0,0,0,0,0,0,"",{"$f":"SUM(K32:K32)","v":0}]
[null,null,null,null,null,null,null,null,0,""]
["Total capital expenditure of Transfers and Grants",null,{"$f":"C25+C27+C29+C31","v":8736597.3699999992},54318250,67648073,3494138.8,9884046.3499999996,37578140,-27694093.649999999,{"$f":"IF(I33=0,\"\",I33/H33)","v":-0.73697350773614656},{"$f":"K25+K27+K29+K31","v":67648073}]
[]
["TOTAL EXPENDITURE OF TRANSFERS AND GRANTS",null,{"$f":"C22+C33","v":54170253.43},363075127,396739967,20049231.870000001,165016147.47,254008594,-88992446.530000001,{"$f":"IF(I35=0,\"\",I35/H35)","v":-0.35035210867707883},{"$f":"K22+K33","v":396739967}]
[{"$f":"head27a","v":"References"}]

{"sheet":"SC7(2)","index":23,"n_rows":30,"n_cols":7,"rows_kept":30,"cut":false,"hidden":false,"merged":[[0,0,0,6],[1,0,2,0],[1,1,2,1],[1,2,1,6]]}
[{"$f":"muni& \" - \"&S71T& \" - \"&Head57","v":"LIM355 Lepelle-Nkumpi - Supporting Table SC7(2) Monthly Budget Statement - Expenditure against approved rollovers - M08 February"}]
[{"$f":"desc","v":"Description"},{"$f":"head27","v":"Ref"},{"$f":"Head2","v":"Budget Year 2020/21"}]
[null,null,{"$f":"\"Approved Rollover \" &Head1","v":"Approved Rollover 2019/20"},{"$f":"Head38","v":"Monthly actual"},{"$f":"Head39","v":"YearTD actual"},{"$f":"Head41","v":"YTD variance"},{"$f":"Head41","v":"YTD variance"}]
["R thousands",null,null,null,null,null,"%"]
["EXPENDITURE"]
[]
["Operating expenditure of Approved Roll-overs"]
[{"$f":"'SC6'!A8","v":"National Government:"},null,{"$f":"SUM(C9:C9)","v":0},{"$f":"SUM(D9:D9)","v":0},{"$f":"SUM(E9:E9)","v":0},{"$f":"SUM(F9:F9)","v":0},{"$f":"IF(F8=0,\"\",F8/C8)","v":""}]
[null,null,null,null,null,{"$f":"E9-C9","v":0},{"$f":"IF(F9=0,\"\",F9/C9)","v":""}]
[{"$f":"'SC6'!A15","v":"Provincial Government:"},null,{"$f":"SUM(C11:C11)","v":0},{"$f":"SUM(D11:D11)","v":0},{"$f":"SUM(E11:E11)","v":0},{"$f":"SUM(F11:F11)","v":0},""]
[null,null,null,null,null,{"$f":"C11-E11","v":0},""]
[{"$f":"'SC6'!A18","v":"District Municipality:"},null,{"$f":"SUM(C13:C13)","v":0},{"$f":"SUM(D13:D13)","v":0},{"$f":"SUM(E13:E13)","v":0},{"$f":"SUM(F13:F13)","v":0},""]
[null,null,null,null,null,{"$f":"C13-E13","v":0},""]
[{"$f":"'SC6'!A20","v":"Other grant providers:"},null,{"$f":"SUM(C15:C15)","v":0},{"$f":"SUM(D15:D15)","v":0},{"$f":"SUM(E15:E15)","v":0},{"$f":"SUM(F15:F15)","v":0},""]
[null,null,null,null,null,{"$f":"C15-E15","v":0},""]
["Total operating expenditure of Approved Roll-overs",null,{"$f":"C8+C10+C12+C14","v":0},{"$f":"D8+D10+D12+D14","v":0},{"$f":"E8+E10+E12+E14","v":0},{"$f":"F8+F10+F12+F14","v":0},""]
[null,null,null,null,null,null,""]
["Capital expenditure of Approved Roll-overs",null,null,null,null,null,""]
[{"$f":"'SC6'!A26","v":"National Government:"},null,{"$f":"SUM(C20:C20)","v":0},{"$f":"SUM(D20:D20)","v":0},{"$f":"SUM(E20:E20)","v":0},{"$f":"SUM(F20:F20)","v":0},""]
[null,null,null,null,null,{"$f":"C20-E20","v":0},""]
[{"$f":"'SC6'!A28","v":"Provincial Government:"},null,{"$f":"SUM(C22:C22)","v":0},{"$f":"SUM(D22:D22)","v":0},{"$f":"SUM(E22:E22)","v":0},{"$f":"SUM(F22:F22)","v":0},""]
[null,null,null,null,null,{"$f":"C22-E22","v":0},""]
[{"$f":"'SC6'!A30","v":"District Municipality:"},null,{"$f":"SUM(C24:C24)","v":0},{"$f":"SUM(D24:D24)","v":0},{"$f":"SUM(E24:E24)","v":0},{"$f":"SUM(F24:F24)","v":0},""]
[null,null,null,null,null,{"$f":"C24-E24","v":0},""]
[{"$f":"'SC6'!A32","v":"Other grant providers:"},null,{"$f":"SUM(C26:C26)","v":0},{"$f":"SUM(D26:D26)","v":0},{"$f":"SUM(E26:E26)","v":0},{"$f":"SUM(F26:F26)","v":0},""]
[null,null,null,null,null,{"$f":"C26-E26","v":0},""]
["Total capital expenditure of Approved Roll-overs",null,{"$f":"C19+C21+C23+C25","v":0},{"$f":"D19+D21+D23+D25","v":0},{"$f":"E19+E21+E23+E25","v":0},{"$f":"F19+F21+F23+F25","v":0},""]
[]
["TOTAL EXPENDITURE OF APPROVED ROLL-OVERS",null,{"$f":"C16+C27","v":0},{"$f":"D16+D27","v":0},{"$f":"E16+E27","v":0},{"$f":"F16+F27","v":0},""]
[{"$f":"head27a","v":"References"}]

{"sheet":"SC8","index":24,"n_rows":116,"n_cols":11,"rows_kept":116,"cut":false,"hidden":false,"merged":[[1,0,2,0],[1,1,2,1],[0,0,0,10]]}
[{"$f":"muni& \" - \"&S71N& \" - \"&Head57","v":"LIM355 Lepelle-Nkumpi - Supporting Table SC8 Monthly Budget Statement - councillor and staff benefits  - M08 February"}]
["Summary of Employee and Councillor remuneration",{"$f":"head27","v":"Ref"},{"$f":"Head1","v":"2019/20"},{"$f":"Head2","v":"Budget Year 2020/21"}]
[null,null,{"$f":"Head5","v":"Audited Outcome"},{"$f":"Head6","v":"Original Budget"},{"$f":"Head7","v":"Adjusted Budget"},{"$f":"Head38","v":"Monthly actual"},{"$f":"Head39","v":"YearTD actual"},{"$f":"Head40","v":"YearTD budget"},{"$f":"Head41","v":"YTD variance"},{"$f":"Head41","v":"YTD variance"},{"$f":"Head8","v":"Full Year Forecast"}]
["R thousands",null,null,null,null,null,null,null,null,"%"]
[null,1,"A","B","C",null,null,null,null,null,"D"]
["Councillors (Political Office Bearers plus Other)"]
["Basic Salaries and Wages",null,2585605.02,18648375,18648375,1650613.37,10020464.33,12432248,{"$f":"G7-H7","v":-2411783.67},{"$f":"IF(I7=0,\"\",I7/H7)","v":-0.19399417305703681},18648375]
["Pension and UIF Contributions",null,0,0,0,0,0,0,0,"",0]
["Medical Aid Contributions",null,0,0,0,0,0,0,0,"",0]
["Motor Vehicle Allowance",null,0,0,0,0,2689924.72,0,{"$f":"G10-H10","v":2689924.72},{"$f":"IF(I10=0,\"\",I10/H10)","v":{"$error":"#DIV/0!"}},0]
["Cellphone Allowance",null,0,2664000,2664000,222000,1772300,1776000,{"$f":"G11-H11","v":-3700},{"$f":"IF(I11=0,\"\",I11/H11)","v":-2.0833333333333333E-3},2664000]
["Housing Allowances",null,0,0,0,0,0,0,{"$f":"G12-H12","v":0},{"$f":"IF(I12=0,\"\",I12/H12)","v":""},0]
["Other benefits and allowances",null,1019964.69,2327115,2327097,0,659095.99,1551405,-892309.01,-0.57516187584802159,2327097]
["Sub Total - Councillors",null,{"$f":"SUM(C7:C13)","v":3605569.71},23639490,23639472,1872613.37,15141785.040000001,15759653,-617867.95999999903,-3.920568301852833E-2,23639472]
["% increase",4,null,{"$f":"IF(D14=0,\"\",(D14/C14)-1)","v":5.5563813492320469},{"$f":"IF(E14=0,\"\",(E14/C14)-1)","v":5.5563763569558056},null,null,null,null,null,{"$f":"IF(K14=0,\"\",(K14/C14)-1)","v":5.5563763569558056}]
[]
["Senior Managers of the Municipality",3]
["Basic Salaries and Wages",null,518400.24,7317452,4703557,249455.25,1891824.45,4355518,{"$f":"G18-H18","v":-2463693.5499999998},{"$f":"IF(I18=0,\"\",I18/H18)","v":-0.56564880457387612},4703557]
["Pension and UIF Contributions",null,141.06,0,0,0,0,0,0,"",0]
["Medical Aid Contributions",null,0,0,0,0,0,0,0,"",0]
["Overtime",null,0,0,0,0,0,0,0,"",0]
["Performance Bonus",null,0,0,0,0,0,0,{"$f":"G22-H22","v":0},{"$f":"IF(I22=0,\"\",I22/H22)","v":""},0]
["Motor Vehicle Allowance",null,0,0,0,0,19571.37,0,{"$f":"G23-H23","v":19571.37},{"$f":"IF(I23=0,\"\",I23/H23)","v":{"$error":"#DIV/0!"}},0]
["Cellphone Allowance",null,12000,144000,102000,10000,134828.98000000001,87600,{"$f":"G24-H24","v":47228.98000000001},{"$f":"IF(I24=0,\"\",I24/H24)","v":0.53914360730593625},102000]
["Housing Allowances",null,0,0,0,0,0,0,{"$f":"G25-H25","v":0},{"$f":"IF(I25=0,\"\",I25/H25)","v":""},0]
["Other benefits and allowances",null,0,0,0,0,0,0,0,"",0]
["Payments in lieu of leave",null,0,0,0,0,0,0,0,"",0]
["Long service awards",null,0,0,0,0,0,0,0,"",0]
["Post-retirement benefit obligations",2,null,null,null,null,null,null,0,""]
["Sub Total - Senior Managers of Municipality",null,{"$f":"SUM(C18:C29)","v":530541.30000000005},7461452,4805557,{"$f":"SUM(F18:F29)","v":259455.25},{"$f":"SUM(G18:G29)","v":2046224.8},{"$f":"SUM(H18:H29)","v":4443118},-2396893.2000000002,{"$f":"IF(I30=0,\"\",I30/H30)","v":-0.53946197242567051},4805557]
["% increase",4,null,{"$f":"IF(D30=0,\"\",(D30/C30)-1)","v":13.063847621287918},{"$f":"IF(E30=0,\"\",(E30/C30)-1)","v":8.0578377215873669},null,null,null,null,null,{"$f":"IF(K30=0,\"\",(K30/C30)-1)","v":8.0578377215873669}]
[]
["Other Municipal Staff"]
["Basic Salaries and Wages",null,15665199.439999999,69158646,68503571,4991482.63,37825429.549999997,47720653,{"$f":"G34-H34","v":-9895223.450000003},{"$f":"IF(I34=0,\"\",I34/H34)","v":-0.20735725158664536},68503571]
["Pension and UIF Contributions",null,3010354.69,14113381,14001265,988774.03,8140906.6500000004,9625540,-1484633.3499999996,-0.15423896737222012,14001265]
["Medical Aid Contributions",null,821024.28,3925084,3721498,303716.15999999997,2441682.6,2752521,-310838.39999999991,-0.11292862070807086,3721498]
["Overtime",null,427665.98,2562000,2704000,72904.289999999994,655172.97,1736416,-1081243.03,-0.62268663154451465,2704000]
["Performance Bonus",null,1343545.67,5074558,4969558,419004.35,3717669.68,3362072,355597.68000000017,0.10576741961504696,4969558]
["Motor Vehicle Allowance",null,3003793.76,8355608,7678952,575048.07999999996,4777319.9800000004,5521967,{"$f":"G39-H39","v":-744647.01999999955},{"$f":"IF(I39=0,\"\",I39/H39)","v":-0.13485176930611856},7678952]
["Cellphone Allowance",null,879945.66,904485,913261,72795,602200,635026,{"$f":"G40-H40","v":-32826},{"$f":"IF(I40=0,\"\",I40/H40)","v":-5.169237165092453E-2},913261]
["Housing Allowances",null,70806.06,339689,348870,23148.240000000002,195795.53,228268,{"$f":"G41-H41","v":-32472.47},{"$f":"IF(I41=0,\"\",I41/H41)","v":-0.14225590095852245},348870]
["Other benefits and allowances",null,10455.35,2339368,2350899,196288.78,3010048.33,1575555,1434493.33,0.91046858408624265,2350899]
["Payments in lieu of leave",null,78108.960000000006,3040795,3070015,28490.880000000001,863611.95,2033052,-1169440.05,-0.57521403781113323,3070015]
["Long service awards",null,85694.3,579279,739766,54901.5,471011.18,418297,52714.179999999993,0.126020937276624,739766]
["Post-retirement benefit obligations",2,0,0,0,0,0,0,0,"",0]
["Sub Total - Other Municipal Staff",null,{"$f":"SUM(C34:C45)","v":25396594.150000002},110392893,109001655,{"$f":"SUM(F34:F45)","v":7726553.9400000004},{"$f":"SUM(G34:G45)","v":62700848.419999994},{"$f":"SUM(H34:H45)","v":75609367},-12908518.580000006,{"$f":"IF(I46=0,\"\",I46/H46)","v":-0.17072644689645405},109001655]
["% increase",4,null,{"$f":"IF(D46=0,\"\",(D46/C46)-1)","v":3.3467597406166369},{"$f":"IF(E46=0,\"\",(E46/C46)-1)","v":3.2919792455713983},null,null,null,null,null,{"$f":"IF(K46=0,\"\",(K46/C46)-1)","v":3.2919792455713983}]
[]
["Total Parent Municipality",null,{"$f":"C14+C30+C46","v":29532705.160000004},{"$f":"D14+D30+D46","v":141493835},137446684,9858622.5600000005,79888858.25999999,95812138,{"$f":"G49-H49","v":-15923279.74000001},{"$f":"IF(I49=0,\"\",I49/H49)","v":-0.16619271913126507},137446684]
[null,null,null,{"$f":"IF(D49=0,\"\",(D49/C49)-1)","v":3.7910895474500439},{"$f":"IF(E49=0,\"\",(E49/C49)-1)","v":3.6540499170445777},null,null,null,null,null,{"$f":"IF(K49=0,\"\",(K49/C49)-1)","v":3.6540499170445777}]
["Unpaid salary, allowances & benefits in arrears:"]
[]
["Board Members of Entities"]
["Basic Salaries and Wages",null,null,null,null,null,null,null,{"$f":"G54-H54","v":0},{"$f":"IF(I54=0,\"\",I54/H54)","v":""}]
["Pension and UIF Contributions",null,null,null,null,null,null,null,0,""]
["Medical Aid Contributions",null,null,null,null,null,null,null,0,""]
["Overtime",null,null,null,null,null,null,null,{"$f":"G57-H57","v":0},{"$f":"IF(I57=0,\"\",I57/H57)","v":""}]
["Performance Bonus",null,null,null,null,null,null,null,{"$f":"G58-H58","v":0},{"$f":"IF(I58=0,\"\",I58/H58)","v":""}]
["Motor Vehicle Allowance",null,null,null,null,null,null,null,{"$f":"G59-H59","v":0},{"$f":"IF(I59=0,\"\",I59/H59)","v":""}]
["Cellphone Allowance",null,null,null,null,null,null,null,{"$f":"G60-H60","v":0},{"$f":"IF(I60=0,\"\",I60/H60)","v":""}]
["Housing Allowances",null,null,null,null,null,null,null,{"$f":"G61-H61","v":0},{"$f":"IF(I61=0,\"\",I61/H61)","v":""}]
["Other benefits and allowances",null,null,null,null,null,null,null,0,""]
["Board Fees",null,null,null,null,null,null,null,{"$f":"G63-H63","v":0},{"$f":"IF(I63=0,\"\",I63/H63)","v":""}]
["Payments in lieu of leave",null,null,null,null,null,null,null,0,""]
["Long service awards",null,null,null,null,null,null,null,0,""]
["Post-retirement benefit obligations",null,null,null,null,null,null,null,0,""]
["Sub Total - Board Members of Entities",2,{"$f":"SUM(C54:C66)","v":0},0,0,{"$f":"SUM(F54:F66)","v":0},{"$f":"SUM(G54:G66)","v":0},{"$f":"SUM(H54:H66)","v":0},0,{"$f":"IF(I67=0,\"\",I67/H67)","v":""},0]
["% increase",4,null,{"$f":"IF(D67=0,\"\",(D67/C67)-1)","v":""},{"$f":"IF(E67=0,\"\",(E67/C67)-1)","v":""},null,null,null,null,null,{"$f":"IF(K67=0,\"\",(K67/C67)-1)","v":""}]
[]
["Senior Managers of Entities"]
["Basic Salaries and Wages",null,null,null,null,null,null,null,{"$f":"G71-H71","v":0},{"$f":"IF(I71=0,\"\",I71/H71)","v":""}]
["Pension and UIF Contributions",null,null,null,null,null,null,null,0,""]
["Medical Aid Contributions",null,null,null,null,null,null,null,0,""]
["Overtime",null,null,null,null,null,null,null,0,""]
["Performance Bonus",null,null,null,null,null,null,null,{"$f":"G75-H75","v":0},{"$f":"IF(I75=0,\"\",I75/H75)","v":""}]
["Motor Vehicle Allowance",null,null,null,null,null,null,null,{"$f":"G76-H76","v":0},{"$f":"IF(I76=0,\"\",I76/H76)","v":""}]
["Cellphone Allowance",null,null,null,null,null,null,null,{"$f":"G77-H77","v":0},{"$f":"IF(I77=0,\"\",I77/H77)","v":""}]
["Housing Allowances",null,null,null,null,null,null,null,{"$f":"G78-H78","v":0},{"$f":"IF(I78=0,\"\",I78/H78)","v":""}]
["Other benefits and allowances",null,null,null,null,null,null,null,0,""]
["Payments in lieu of leave",null,null,null,null,null,null,null,0,""]
["Long service awards",null,null,null,null,null,null,null,0,""]
["Post-retirement benefit obligations",2,null,null,null,null,null,null,0,""]
["Sub Total - Senior Managers of Entities",null,{"$f":"SUM(C71:C82)","v":0},0,0,{"$f":"SUM(F71:F82)","v":0},{"$f":"SUM(G71:G82)","v":0},{"$f":"SUM(H71:H82)","v":0},0,{"$f":"IF(I83=0,\"\",I83/H83)","v":""},0]
["% increase",4,null,{"$f":"IF(D83=0,\"\",(D83/C83)-1)","v":""},{"$f":"IF(E83=0,\"\",(E83/C83)-1)","v":""},null,null,null,null,null,{"$f":"IF(K83=0,\"\",(K83/C83)-1)","v":""}]
[]
["Other Staff of Entities"]
["Basic Salaries and Wages",null,null,null,null,null,null,null,{"$f":"G87-H87","v":0},{"$f":"IF(I87=0,\"\",I87/H87)","v":""}]
["Pension and UIF Contributions",null,null,null,null,null,null,null,0,""]
["Medical Aid Contributions",null,null,null,null,null,null,null,{"$f":"G89-H89","v":0},{"$f":"IF(I89=0,\"\",I89/H89)","v":""}]
["Overtime",null,null,null,null,null,null,null,{"$f":"G90-H90","v":0},{"$f":"IF(I90=0,\"\",I90/H90)","v":""}]
["Performance Bonus",null,null,null,null,null,null,null,{"$f":"G91-H91","v":0},{"$f":"IF(I91=0,\"\",I91/H91)","v":""}]
["Motor Vehicle Allowance",null,null,null,null,null,null,null,{"$f":"G92-H92","v":0},{"$f":"IF(I92=0,\"\",I92/H92)","v":""}]
["Cellphone Allowance",null,null,null,null,null,null,null,0,""]
["Housing Allowances",null,null,null,null,null,null,null,0,""]
["Other benefits and allowances",null,null,null,null,null,null,null,0,""]
["Payments in lieu of leave",null,null,null,null,null,null,null,0,""]
["Long service awards",null,null,null,null,null,null,null,0,""]
["Post-retirement benefit obligations",null,null,null,null,null,null,null,0,""]
["Sub Total - Other Staff of Entities",null,{"$f":"SUM(C87:C98)","v":0},0,0,0,0,0,0,{"$f":"IF(I99=0,\"\",I99/H99)","v":""},{"$f":"SUM(K87:K98)","v":0}]
["% increase",4,null,{"$f":"IF(D99=0,\"\",(D99/C99)-1)","v":""},{"$f":"IF(E99=0,\"\",(E99/C99)-1)","v":""},null,null,null,null,null,{"$f":"IF(K99=0,\"\",(K99/C99)-1)","v":""}]
[]
["Total Municipal Entities",null,{"$f":"C67+C83+C99","v":0},0,0,0,0,0,{"$f":"G102-H102","v":0},{"$f":"IF(I102=0,\"\",I102/H102)","v":""},{"$f":"K67+K83+K99","v":0}]
[]
["TOTAL SALARY, ALLOWANCES & BENEFITS",null,{"$f":"C49+C102","v":29532705.160000004},141493835,137446684,9858622.5600000005,79888858.25999999,95812138,{"$f":"G104-H104","v":-15923279.74000001},{"$f":"IF(I104=0,\"\",I104/H104)","v":-0.16619271913126507},{"$f":"K49+K102","v":137446684}]
["% increase",4,null,{"$f":"IF(D104=0,\"\",(D104/C104)-1)","v":3.7910895474500439},{"$f":"IF(E104=0,\"\",(E104/C104)-1)","v":3.6540499170445777},null,null,null,null,null,{"$f":"IF(K104=0,\"\",(K104/C104)-1)","v":3.6540499170445777}]
["TOTAL MANAGERS AND STAFF",null,{"$f":"C30+C46+C83+C99","v":25927135.450000003},117854345,113807212,7986009.1900000004,64747073.219999991,80052485,-15305411.780000005,{"$f":"IF(I106=0,\"\",I106/H106)","v":-0.19119221320862187},{"$f":"K30+K46+K83+K99","v":113807212}]
[{"$f":"head27a","v":"References"}]
["1. Include 'Loans and advances' where applicable if any reportable amounts until phased compliance with s164 of MFMA achieved"]
["2. If benefits in kind are provided (e.g. provision of living quarters) the full market value must be shown as the cost to the municipality"]
["3. s57 of the Systems Act"]
["4. B/A, C/A, D/A"]
["Column Definitions:"]
["A. Audited actual 2005/06 (audited financial statements). If audited amounts unavailable, unaudited amounts must be provided with a note stating these are unaudited"]
["B. The original budget approved by council for the 2006/07 budget year."]
["C. The budget for 2006/07 budget year as adjusted by council resolution in terms of section 28 of the MFMA."]
["D. An estimate of final actual amounts (pre audit - 2006/07 budget year) at the time of preparing the budget for the 2007/08 budget year. This may differ from C."]

{"sheet":"SC9","index":25,"n_rows":66,"n_cols":17,"rows_kept":66,"cut":false,"hidden":false,"merged":[[2,15,3,15],[2,16,3,16],[1,0,2,0],[2,14,3,14],[1,1,2,1],[1,2,1,13],[1,14,1,16]]}
[{"$f":"muni& \" - \"&S71O& \" - \"&Head57","v":"LIM355 Lepelle-Nkumpi - Supporting Table SC9 Monthly Budget Statement - actuals and revised targets for cash receipts - M08 February"}]
[{"$f":"desc","v":"Description"},{"$f":"head27","v":"Ref"},{"$f":"Head2","v":"Budget Year 2020/21"},null,null,null,null,null,null,null,null,null,null,null,{"$f":"'Template names'!B5","v":"2020/21 Medium Term Revenue & Expenditure Framework"}]
[null,null,"July","August","Sept","October","Nov","Dec","January","Feb","March","April","May","June",{"$f":"Head9","v":"Budget Year 2020/21"},{"$f":"Head10","v":"Budget Year +1 2021/22"},{"$f":"Head11","v":"Budget Year +2 2022/23"}]
["R thousands",1,"Outcome","Outcome","Outcome","Outcome","Outcome","Outcome","Outcome","Outcome","Budget","Budget","Budget","Budget"]
["Cash Receipts By Source"]
["Property rates",null,583213.73,378204.05,1477193.65,1248286.52,879885.49,660446.18000000005,896929.76,1101189.72,1601954,1601954,1601954,{"$f":"O6-SUM(C6:M6)","v":7192240.9000000022},19223452,42291596,46520756]
["Service charges - electricity revenue",null,null,null,null,null,null,null,null,null,null,null,null,0]
["Service charges - water revenue",null,1980972.96,1609307.06,2049767.3,1926779.48,2530605.21,1686235.44,2222771.08,2855141.52,0,0,0,-16861580.050000001,0,0,0]
["Service charges - sanitation revenue",null,13768.17,121424.96000000001,152787.19,172517,131719.44,98421.7,118204.35,171102.3,0,0,0,-979945.10999999987,0,0,0]
["Service charges - refuse",null,168396.62,150532.29,297264.75,216468.12,232724.72,186292.62,258943.76,343697.7,241417,241417,241417,318432.41999999993,2897004,6373260,7010432]
[]
["Rental of facilities and equipment",null,21219.83,21219.83,21219.83,29186.31,20925.45,4000,695.66,695.66,41737,41737,41737,256471.43,500845,1047766,1095966]
["Interest earned - external investments",null,3061328.73,0,0,0,0,0,0,0,625457,625457,625457,2567791.2699999996,7505491,15701488,16423756]
["Interest earned - outstanding debtors",null,null,null,null,null,null,null,null,null,null,null,null,0]
["Dividends received",null,0,0,0,0,0,0,0,0,0,0,0,0,0,0,0]
["Fines, penalties and forfeits",null,103640.96000000001,284765.18,455850.01,860350.02,263281,-1326740.99,22365,11015,218879,218879,218879,1295385.82,2626549,5494742,5747500]
["Licences and permits",null,249,13.04,0,0,249,94,0,0,943,943,943,7889.96,11324,23690,24780]
["Agency services",null,12307663.99,-1307821.77,1899718.5,-9804875.9700000007,-1371313.79,2145716.9500000002,197281.6,599146.35,1453104,1453104,1453104,8412428.1400000006,17437256,36478740,38156762]
["Transfers and Subsidies - Operational",null,null,null,null,null,null,null,null,null,null,null,null,0]
["Other revenue",null,263912877.90000001,22956253.59,27587102.690000001,45200372.100000001,29940479.460000001,27846502.600000001,36474266.390000001,9880616.3399999999,36306658,36306658,36306658,-137038534.06999993,435679911,-91709794,-98556196]
["Cash Receipts by Source",null,{"$f":"SUM(C6:C10)+SUM(C12:C20)","v":282153331.89000005},{"$f":"SUM(D6:D10)+SUM(D12:D20)","v":24213898.23},33940903.920000002,39849083.579999998,32628555.98,31300968.500000004,40191457.600000001,14962604.59,40490149,40490149,40490149,-134829419.28999993,485881832,15701488,16423756]
[null,null,null,null,null,null,null,null,null,null,null,null,null,{"$f":"O22-SUM(C22:M22)","v":0}]
["Other Cash Flows by Source",null,null,null,null,null,null,null,null,null,null,null,null,0]
[{"$f":"'C4-FinPerf RE'!A39","v":"Transfers and subsidies - capital (monetary allocations) (National / Provincial and District)"},null,null,null,null,null,null,null,null,null,null,null,null,0]
[{"$f":"'C4-FinPerf RE'!A40","v":"Transfers and subsidies - capital (monetary allocations) (National / Provincial Departmental Agencies, Households, Non-profit Institutions, Private Enterprises, Public Corporatons, Higher Educational Institutions)"},null,null,null,null,null,null,null,null,null,null,null,null,0]
["Proceeds on Disposal of Fixed and Intangible Assets",null,null,null,null,null,null,null,null,null,null,null,null,0]
["Short term loans",null,null,null,null,null,null,null,null,null,null,null,null,0]
["Borrowing long term/refinancing",null,null,null,null,null,null,null,null,null,null,null,null,0]
["Increase (decrease) in consumer deposits",null,0,0,0,0,0,0,0,0,0,0,0,1891836,1891836,-44000,35600]
[]
["Decrease (increase) in non-current receivables",null,0,0,0,0,0,0,0,0,0,0,0,0,0,0,0]
["Decrease (increase) in non-current investments",null,0,0,0,0,0,0,0,0,0,0,0,0,0,0,0]
["Total Cash Receipts by Source",null,{"$f":"SUM(C21:C29)+SUM(C31:C32)","v":282153331.89000005},{"$f":"SUM(D21:D29)+SUM(D31:D32)","v":24213898.23},33940903.920000002,39849083.579999998,32628555.98,31300968.500000004,40191457.600000001,14962604.59,40490149,40490149,40490149,-132937583.28999993,487773668,15657488,16459356]
[null,null,null,null,null,null,null,null,null,null,null,null,null,{"$f":"O34-SUM(C34:M34)","v":0}]
["Cash Payments by Type",null,null,null,null,null,null,null,null,null,null,null,null,0]
["Employee related costs",null,-10724838.310000001,0,0,0,-32293265.899999999,-5656280.0899999999,-26098512.93,-10493900.84,0,0,0,85266798.069999993,0,0,0]
["Remuneration of councillors",null,null,null,null,null,null,null,null,null,null,null,null,0]
["Interest paid",null,null,null,null,null,null,null,null,null,null,null,null,0]
["Bulk purchases - Electricity",null,null,null,null,null,null,null,null,null,null,null,null,0]
["Bulk purchases - Water & Sewer",null,null,null,null,null,null,null,null,null,null,null,null,0]
["Other materials",null,null,null,null,null,null,null,null,null,null,null,null,0]
["Contracted services",null,null,null,null,null,null,null,null,null,null,null,null,0]
["Grants and subsidies paid - other municipalities",null,null,null,null,null,null,null,null,null,null,null,null,0]
["Grants and subsidies paid - other",null,null,null,null,null,null,null,null,null,null,null,null,0]
["General expenses",null,37050700.340000004,17049248.100000001,11024513.25,0,36667157.109999999,16469545.52,7814703.8399999999,4675074.09,15006162,15006162,15006162,4304538.75,180073967,0,0]
["Cash Payments by Type",{"$f":"SUM(B36:B45)","v":0},{"$f":"SUM(C36:C45)","v":26325862.030000001},{"$f":"SUM(D36:D45)","v":17049248.100000001},11024513.25,0,4373891.2100000009,10813265.43,-18283809.09,-5818826.75,15006162,15006162,15006162,89571336.819999993,180073967,0,0]
[null,null,null,null,null,null,null,null,null,null,null,null,null,{"$f":"O47-SUM(C47:M47)","v":0}]
["Other Cash Flows/Payments by Type"]
["Capital assets",null,0,2762389.24,3884812.03,529086.29,8750004.2100000009,4221519.49,511017.16,1777210.5,11222341,11222341,11222341,{"$f":"O49-SUM(C49:M49)","v":78565188.079999998},134668250,192255906,241456806]
["Repayment of borrowing",null,0,0,0,0,0,0,0,0,0,0,0,{"$f":"O50-SUM(C50:M50)","v":0},0,0,0]
["Other Cash Flows/Payments",null,null,null,null,null,null,null,null,null,null,null,null,{"$f":"O51-SUM(C51:M51)","v":0}]
["Total Cash Payments by Type",{"$f":"SUM(B46:B51)","v":0},26325862.030000001,19811637.340000004,14909325.279999999,529086.29,13123895.420000002,15034784.92,-17772791.93,-4041616.25,26228503,26228503,26228503,168136524.89999998,314742217,192255906,241456806]
[null,null,null,null,null,null,null,null,null,null,null,null,null,{"$f":"O53-SUM(C53:M53)","v":0}]
["NET INCREASE/(DECREASE) IN CASH HELD",{"$f":"B33-B52","v":0},255827469.86000004,4402260.8899999969,19031578.640000001,39319997.289999999,19504660.559999999,16266183.580000004,57964249.530000001,19004220.84,14261646,14261646,14261646,-301074108.18999994,173031451,-176598418,-224997450]
["Cash/cash equivalents at the month/year beginning:",null,117948567.48999999,{"$f":"C56","v":373776037.35000002},{"$f":"D56","v":378178298.24000001},397209876.88,436529874.17000002,456034534.73000002,472300718.31,530264967.84000003,549269188.68000007,563530834.68000007,577792480.68000007,592054126.68000007,{"$f":"C55","v":117948567.48999999},{"$f":"O56","v":290980018.49000001},{"$f":"P56","v":114381600.49000001}]
["Cash/cash equivalents at the month/year end:",null,{"$f":"C54+C55","v":373776037.35000002},{"$f":"D54+D55","v":378178298.24000001},{"$f":"E54+E55","v":397209876.88},436529874.17000002,456034534.73000002,472300718.31,530264967.84000003,549269188.68000007,563530834.68000007,577792480.68000007,592054126.68000007,290980018.49000013,{"$f":"O54+O55","v":290980018.49000001},{"$f":"P54+P55","v":114381600.49000001},{"$f":"Q54+Q55","v":-110615849.50999999}]
[{"$f":"head27a","v":"References"}]
["1. Replace 'budget' heading with adjusted budget, or 'outcome' only for month/s complete"]
["2. Total of monthly amounts must always agree to the approved or adjusted budget"]
["3. Amend 'cash-at-beginning' when prior year actual known (as part of the adjustments budget)"]
[]
[]
[]
[]
[null,null,null,null,{"$f":"E46+E64","v":11024513.25},0,4373891.2100000009,10813265.43,-18283809.09,-5818826.75,15006162,15006162,null,{"$f":"N46+N64","v":89571336.819999993},180073967,0]
[null,null,null,null,{"$f":"E54-E64","v":19031578.640000001},39319997.289999999,19504660.559999999,16266183.580000004,57964249.530000001,19004220.84,14261646,14261646,{"$f":"M54-M64","v":14261646},{"$f":"N54-N64","v":-301074108.18999994},173031451,-176598418]

{"sheet":"SC10","index":26,"n_rows":46,"n_cols":11,"rows_kept":46,"cut":false,"hidden":false,"merged":[[1,0,2,0],[1,1,2,1],[0,0,0,10]]}
[{"$f":"muni& \" - \"&S71P& \" - \"&Head57","v":"LIM355 Lepelle-Nkumpi - NOT REQUIRED - municipality does not have entities or this is the parent municipality's budget - M08 February"}]
[{"$f":"desc","v":"Description"},{"$f":"head27","v":"Ref"},{"$f":"Head1","v":"2019/20"},{"$f":"Head2","v":"Budget Year 2020/21"}]
[null,null,{"$f":"Head5","v":"Audited Outcome"},{"$f":"Head6","v":"Original Budget"},{"$f":"Head7","v":"Adjusted Budget"},{"$f":"Head38","v":"Monthly actual"},{"$f":"Head39","v":"YearTD actual"},{"$f":"Head40","v":"YearTD budget"},{"$f":"Head41","v":"YTD variance"},{"$f":"Head41","v":"YTD variance"},{"$f":"Head8","v":"Full Year Forecast"}]
["R thousands",1,null,null,null,null,null,null,null,"%"]
[{"$f":"'C4-FinPerf RE'!A5","v":"Revenue By Source"}]
[{"$f":"'C4-FinPerf RE'!A6","v":"Property rates"},null,null,null,null,null,null,null,{"$f":"G6-H6","v":0},{"$f":"IF(I6=0,\"\",I6/H6)","v":""}]
[{"$f":"'C4-FinPerf RE'!A7","v":"Service charges - electricity revenue"},null,null,null,null,null,null,null,0,{"$f":"IF(I7=0,\"\",I7/H7)","v":""}]
[{"$f":"'C4-FinPerf RE'!A8","v":"Service charges - water revenue"},null,null,null,null,null,null,null,0,""]
[{"$f":"'C4-FinPerf RE'!A9","v":"Service charges - sanitation revenue"},null,null,null,null,null,null,null,0,""]
[{"$f":"'C4-FinPerf RE'!A10","v":"Service charges - refuse revenue"},null,null,null,null,null,null,null,0,""]
[]
[{"$f":"'C4-FinPerf RE'!A12","v":"Rental of facilities and equipment"},null,null,null,null,null,null,null,0,""]
[{"$f":"'C4-FinPerf RE'!A13","v":"Interest earned - external investments"},null,null,null,null,null,null,null,0,""]
[{"$f":"'C4-FinPerf RE'!A14","v":"Interest earned - outstanding debtors"},null,null,null,null,null,null,null,0,""]
[{"$f":"'C4-FinPerf RE'!A15","v":"Dividends received"},null,null,null,null,null,null,null,0,""]
[{"$f":"'C4-FinPerf RE'!A16","v":"Fines, penalties and forfeits"},null,null,null,null,null,null,null,0,""]
[{"$f":"'C4-FinPerf RE'!A17","v":"Licences and permits"},null,null,null,null,null,null,null,0,""]
[{"$f":"'C4-FinPerf RE'!A18","v":"Agency services"},null,null,null,null,null,null,null,0,""]
[{"$f":"'C4-FinPerf RE'!A19","v":"Transfers and subsidies"},null,null,null,null,null,null,null,0,""]
[{"$f":"'C4-FinPerf RE'!A20","v":"Other revenue"},null,null,null,null,null,null,null,0,""]
[{"$f":"'C4-FinPerf RE'!A21","v":"Gains"},null,null,null,null,null,null,null,0,""]
["Total Revenue (excluding capital transfers and contributions)",null,{"$f":"SUM(C6:C10)+SUM(C12:C21)","v":0},0,0,0,0,0,{"$f":"G22-H22","v":0},"",{"$f":"SUM(K6:K10)+SUM(K12:K21)","v":0}]
[]
["Expenditure By Type"]
[{"$f":"'C4-FinPerf RE'!A25","v":"Employee related costs"},null,null,null,null,null,null,null,{"$f":"G25-H25","v":0},{"$f":"IF(I25=0,\"\",I25/H25)","v":""}]
[{"$f":"'C4-FinPerf RE'!A26","v":"Remuneration of councillors"},null,null,null,null,null,null,null,0,""]
[{"$f":"'C4-FinPerf RE'!A27","v":"Debt impairment"},null,null,null,null,null,null,null,0,""]
[{"$f":"'C4-FinPerf RE'!A28","v":"Depreciation & asset impairment"},null,null,null,null,null,null,null,0,""]
[{"$f":"'C4-FinPerf RE'!A29","v":"Finance charges"},null,null,null,null,null,null,null,0,""]
[{"$f":"'C4-FinPerf RE'!A30","v":"Bulk purchases"},null,null,null,null,null,null,null,0,""]
[{"$f":"'C4-FinPerf RE'!A31","v":"Other materials"},null,null,null,null,null,null,null,0,""]
[{"$f":"'C4-FinPerf RE'!A32","v":"Contracted services"},null,null,null,null,null,null,null,0,""]
[{"$f":"'C4-FinPerf RE'!A33","v":"Transfers and subsidies"},null,null,null,null,null,null,null,0,""]
[{"$f":"'C4-FinPerf RE'!A34","v":"Other expenditure"},null,null,null,null,null,null,null,0,""]
[{"$f":"'C4-FinPerf RE'!A35","v":"Losses"},null,null,null,null,null,null,null,0,""]
["Total Expenditure",null,{"$f":"SUM(C25:C35)","v":0},0,0,0,0,0,0,"",{"$f":"SUM(K25:K35)","v":0}]
[null,null,null,null,null,null,null,null,0]
[{"$f":"'C4-FinPerf RE'!A38","v":"Surplus/(Deficit)"},null,{"$f":"C22-C36","v":0},0,0,0,0,0,0,"",{"$f":"K22-K36","v":0}]
[{"$f":"'C4-FinPerf RE'!A39","v":"Transfers and subsidies - capital (monetary allocations) (National / Provincial and District)"},null,null,null,null,null,null,null,0,""]
[{"$f":"'C4-FinPerf RE'!A40","v":"Transfers and subsidies - capital (monetary allocations) (National / Provincial Departmental Agencies, Households, Non-profit Institutions, Private Enterprises, Public Corporatons, Higher Educational Institutions)"},null,null,null,null,null,null,null,0,""]
[{"$f":"'C4-FinPerf RE'!A41","v":"Transfers and subsidies - capital (in-kind - all) "},null,null,null,null,null,null,null,0,""]
[{"$f":"'C4-FinPerf RE'!A42","v":"Surplus/(Deficit) after capital transfers & contributions"},null,{"$f":"C38+SUM(C39:C41)","v":0},{"$f":"D38+SUM(D39:D41)","v":0},0,0,0,0,0,"",0]
[{"$f":"'C4-FinPerf RE'!A43","v":"Taxation"},null,null,null,null,null,null,null,0,""]
[{"$f":"'C4-FinPerf RE'!A44","v":"Surplus/(Deficit) after taxation"},null,{"$f":"C42-C43","v":0},0,0,0,0,0,0,"",{"$f":"K42-K43","v":0}]
[{"$f":"head27a","v":"References"}]
["1. Votes (consolidated) are revenue sources and expenditure type"]

{"sheet":"SC11","index":27,"n_rows":49,"n_cols":11,"rows_kept":49,"cut":false,"hidden":false,"merged":[[1,0,2,0],[1,1,2,1],[0,0,0,10],[1,3,1,10]]}
[{"$f":"muni& \" - \"&S71Q& \" - \"&Head57","v":"LIM355 Lepelle-Nkumpi - NOT REQUIRED - municipality does not have entities or this is the parent municipality's budget - M08 February"}]
[{"$f":"desc","v":"Description"},{"$f":"head27","v":"Ref"},{"$f":"Head1","v":"2019/20"},{"$f":"Head2","v":"Budget Year 2020/21"}]
[null,null,{"$f":"Head5","v":"Audited Outcome"},{"$f":"Head6","v":"Original Budget"},{"$f":"Head7","v":"Adjusted Budget"},{"$f":"Head38","v":"Monthly actual"},{"$f":"Head39","v":"YearTD actual"},{"$f":"Head40","v":"YearTD budget"},{"$f":"Head41","v":"YTD variance"},{"$f":"Head41","v":"YTD variance"},{"$f":"Head8","v":"Full Year Forecast"}]
["R thousands",null,null,null,null,null,null,null,null,"%"]
["Revenue By Municipal Entity"]
["Insert name of municipal entity",null,null,null,null,null,null,null,{"$f":"G6-H6","v":0},{"$f":"IF(I6=0,\"\",I6/H6)","v":""}]
[null,null,null,null,null,null,null,null,0,{"$f":"IF(I7=0,\"\",I7/H7)","v":""}]
[null,null,null,null,null,null,null,null,0,""]
[null,null,null,null,null,null,null,null,0,""]
[null,null,null,null,null,null,null,null,0,""]
[null,null,null,null,null,null,null,null,0,""]
[null,null,null,null,null,null,null,null,0,""]
[null,null,null,null,null,null,null,null,0,""]
[null,null,null,null,null,null,null,null,0,""]
[null,null,null,null,null,null,null,null,0,""]
["Total Operating Revenue",1,{"$f":"SUM(C6:C15)","v":0},0,0,0,0,0,0,"",{"$f":"SUM(K6:K15)","v":0}]
[]
["Expenditure By Municipal Entity"]
[{"$f":"A6","v":"Insert name of municipal entity"},null,null,null,null,null,null,null,0,{"$f":"IF(I19=0,\"\",I19/H19)","v":""}]
[{"$f":"IF(A7=\"\",\"\",A7)","v":""},null,null,null,null,null,null,null,0,""]
[{"$f":"IF(A8=\"\",\"\",A8)","v":""},null,null,null,null,null,null,null,0,""]
["",null,null,null,null,null,null,null,0,""]
["",null,null,null,null,null,null,null,0,""]
["",null,null,null,null,null,null,null,0,""]
["",null,null,null,null,null,null,null,0,""]
["",null,null,null,null,null,null,null,0,""]
["",null,null,null,null,null,null,null,0,""]
["",null,null,null,null,null,null,null,0,""]
["Total Operating Expenditure",2,{"$f":"SUM(C19:C28)","v":0},0,0,0,0,0,0,"",{"$f":"SUM(K19:K28)","v":0}]
[null,null,null,null,null,null,null,null,null,""]
[{"$f":"Head42","v":"Surplus/ (Deficit) for the yr/period"},null,{"$f":"C16-C29","v":0},{"$f":"D16-D29","v":0},0,0,0,0,{"$f":"I16+I29","v":0},"",0]
["Capital Expenditure By Municipal Entity"]
[{"$f":"$A$6","v":"Insert name of municipal entity"},null,null,null,null,null,null,null,0,""]
[{"$f":"IF(A7=\"\",\"\",A7)","v":""},null,null,null,null,null,null,null,0,""]
[{"$f":"IF(A8=\"\",\"\",A8)","v":""},null,null,null,null,null,null,null,0,""]
["",null,null,null,null,null,null,null,0,""]
["",null,null,null,null,null,null,null,0,""]
["",null,null,null,null,null,null,null,0,""]
["",null,null,null,null,null,null,null,0,""]
["",null,null,null,null,null,null,null,0,""]
["",null,null,null,null,null,null,null,0,""]
[null,null,null,null,null,null,null,null,null,""]
["Total Capital Expenditure",3,{"$f":"SUM(C32:C42)","v":0},{"$f":"SUM(D32:D42)","v":0},0,0,0,{"$f":"SUM(H32:H42)","v":0},{"$f":"G43-H43","v":0},"",0]
[{"$f":"head27a","v":"References"}]
["1. Must reconcile to the sum of all municipal entity monthly revenue reports"]
["2. Must reconcile to the sum of all municipal entity monthly expenditure reports"]
["3. YTD = Year to date; FAV - favourable variance or unfavourable variance"]
["4. Material variances to be explained"]
["5. Insert additional 'Adjustment' Budget column for each Adjustment made by an entity"]

{"sheet":"SC12","index":28,"n_rows":18,"n_cols":10,"rows_kept":18,"cut":false,"hidden":false,"merged":[[1,0,2,0],[0,0,0,9],[1,2,1,9]]}
[{"$f":"muni& \" - \"&S71R& \" - \"&Head57","v":"LIM355 Lepelle-Nkumpi - Supporting Table SC12 Monthly Budget Statement - capital expenditure trend - M08 February"}]
["Month",{"$f":"Head1","v":"2019/20"},{"$f":"Head2","v":"Budget Year 2020/21"}]
[null,{"$f":"Head5","v":"Audited Outcome"},{"$f":"Head6","v":"Original Budget"},{"$f":"Head7","v":"Adjusted Budget"},{"$f":"Head38","v":"Monthly actual"},{"$f":"Head39","v":"YearTD actual"},{"$f":"Head40","v":"YearTD budget"},{"$f":"Head41","v":"YTD variance"},{"$f":"Head41","v":"YTD variance"},"% spend of Original Budget"]
["R thousands",null,null,null,null,null,null,null,"%"]
["Monthly expenditure performance trend"]
["July",0,11222354.189999999,11222357,0,{"$f":"IF(E6>0,E6,\"\")","v":""},{"$f":"IF(D6>0,D6,C6)","v":11222357},{"$f":"IF(F6=\"\",0,G6-F6)","v":0},{"$f":"IF(F6=\"\",\"\",IF(H6=0,\"\",H6/G6))","v":""},{"$f":"IF(F6=\"\",\"\",F6/$C$18)","v":""}]
["August",0,11222354.189999999,11222357,2762389.24,{"$f":"IF(E7>0,E7+F6,\"\")","v":{"$error":"#VALUE!"}},{"$f":"IF(D7>0,D7+D6,C7+C6)","v":22444714},{"$error":"#VALUE!"},{"$error":"#VALUE!"},{"$error":"#VALUE!"}]
["September",0,11222354.189999999,13874357,3884812.03,{"$f":"IF(E8>0,E8+F7,\"\")","v":{"$error":"#VALUE!"}},{"$f":"IF(D8>0,D8+G7,C8+G7)","v":36319071},{"$error":"#VALUE!"},{"$error":"#VALUE!"},{"$error":"#VALUE!"}]
["October",0,11222354.189999999,13874357,529086.29,{"$error":"#VALUE!"},{"$f":"IF(D9>0,D9+G8,C9+G8)","v":50193428},{"$error":"#VALUE!"},{"$error":"#VALUE!"},{"$error":"#VALUE!"}]
["November",0,11222354.189999999,13874357,8750004.2100000009,{"$error":"#VALUE!"},64067785,{"$error":"#VALUE!"},{"$error":"#VALUE!"},{"$error":"#VALUE!"}]
["December",0,11222354.189999999,13874357,4221519.49,{"$error":"#VALUE!"},77942142,{"$error":"#VALUE!"},{"$error":"#VALUE!"},{"$error":"#VALUE!"}]
["January",0,11222354.189999999,13874357,511017.16,{"$error":"#VALUE!"},91816499,{"$error":"#VALUE!"},{"$error":"#VALUE!"},{"$error":"#VALUE!"}]
["February",0,11222354.189999999,14540665,1777210.5,{"$error":"#VALUE!"},106357164,{"$error":"#VALUE!"},{"$error":"#VALUE!"},{"$error":"#VALUE!"}]
["March",0,11222354.189999999,14540665,0,"",120897829,0,"",""]
["April",0,11222354.189999999,14540665,0,"",135438494,0,"",""]
["May",0,11222354.189999999,14540665,0,"",149979159,0,"",""]
["June",0,11222353.91,14540631,0,"",164519790,{"$f":"IF(F17=\"\",0,G17-F17)","v":0},{"$f":"IF(F17=\"\",\"\",IF(H17=0,\"\",H17/G17))","v":""},{"$f":"IF(F17=\"\",\"\",F17/$C$18)","v":""}]
["Total Capital expenditure",{"$f":"SUM(B6:B17)","v":0},{"$f":"SUM(C6:C17)","v":134668250},{"$f":"SUM(D6:D17)","v":164519790},{"$f":"SUM(E6:E17)","v":22436038.919999998}]

{"sheet":"SC13a","index":29,"n_rows":171,"n_cols":11,"rows_kept":171,"cut":false,"hidden":false,"merged":[[1,0,2,0],[1,1,2,1],[0,0,0,10]]}
[{"$f":"muni& \" - \"&S71Sa& \" - \"&Head57","v":"LIM355 Lepelle-Nkumpi - Supporting Table SC13a Monthly Budget Statement - capital expenditure on new assets by asset class - M08 February"}]
[{"$f":"desc","v":"Description"},{"$f":"head27","v":"Ref"},{"$f":"Head1","v":"2019/20"},{"$f":"Head2","v":"Budget Year 2020/21"}]
[null,null,{"$f":"Head5","v":"Audited Outcome"},{"$f":"Head6","v":"Original Budget"},{"$f":"Head7","v":"Adjusted Budget"},{"$f":"Head38","v":"Monthly actual"},{"$f":"Head39","v":"YearTD actual"},{"$f":"Head40","v":"YearTD budget"},{"$f":"Head41","v":"YTD variance"},{"$f":"Head41","v":"YTD variance"},{"$f":"Head8","v":"Full Year Forecast"}]
["R thousands",1,null,null,null,null,null,null,null,"%"]
["Capital expenditure on new assets by Asset Class/Sub-class"]
[]
["Infrastructure",null,{"$f":"C8+C13+C17+C27+C38+C45+C53+C63+C69","v":12687061.929999998},78450000,93978500,-1132047.6899999997,14881023.51,63485708,{"$f":"H7-G7","v":48604684.490000002},{"$f":"IF(I7=0,\"\",I7/H7)","v":0.76560041655359667},{"$f":"K8+K13+K17+K27+K38+K45+K53+K63+K69","v":93978500}]
["Roads Infrastructure",null,{"$f":"SUM(C9:C12)","v":12576499.539999999},67000000,86278500,-1132047.6899999997,12607143.51,56602372,43995228.490000002,0.77726828285570793,{"$f":"SUM(K9:K12)","v":86278500}]
["Roads",null,0,3000000,0,-2468598.2999999998,0,4760000,4760000,1,0]
["Road Structures",null,12576499.539999999,64000000,86278500,1336550.6100000001,12607143.51,51842372,39235228.490000002,0.75681777234266989,86278500]
["Road Furniture",null,null,null,null,null,null,null,0,""]
["Capital Spares",null,null,null,null,null,null,null,0,""]
["Storm water Infrastructure",null,{"$f":"SUM(C14:C16)","v":0},3750000,0,0,0,1750000,1750000,1,{"$f":"SUM(K14:K16)","v":0}]
["Drainage Collection",null,null,null,null,null,null,null,0,""]
["Storm water Conveyance",null,0,3750000,0,0,0,1750000,1750000,1,0]
["Attenuation",null,null,null,null,null,null,null,0,""]
["Electrical Infrastructure",null,{"$f":"SUM(C18:C26)","v":111127.61},7500000,7500000,0,2273880,5000000,2726120,0.54522400000000004,{"$f":"SUM(K18:K26)","v":7500000}]
["Power Plants",null,null,null,null,null,null,null,0,""]
["HV Substations",null,null,null,null,null,null,null,0,""]
["HV Switching Station",null,null,null,null,null,null,null,0,""]
["HV Transmission Conductors",null,null,null,null,null,null,null,0,""]
["MV Substations",null,null,null,null,null,null,null,0,""]
["MV Switching Stations",null,null,null,null,null,null,null,0,""]
["MV Networks",null,0,4125000,4125000,0,0,2750000,2750000,1,4125000]
["LV Networks",null,111127.61,3375000,3375000,0,2273880,2250000,-23880,-1.0613333333333334E-2,3375000]
["Capital Spares",null,null,null,null,null,null,null,0,""]
["Water Supply Infrastructure",null,{"$f":"SUM(C28:C37)","v":-565.22},0,0,0,0,0,0,"",{"$f":"SUM(K28:K37)","v":0}]
["Dams and Weirs",null,null,null,null,null,null,null,0,""]
["Boreholes",null,null,null,null,null,null,null,0,""]
["Reservoirs",null,null,null,null,null,null,null,0,""]
["Pump Stations",null,null,null,null,null,null,null,0,""]
["Water Treatment Works",null,null,null,null,null,null,null,0,""]
["Bulk Mains",null,null,null,null,null,null,null,0,""]
["Distribution",null,null,null,null,null,null,null,0,""]
["Distribution Points",null,null,null,null,null,null,null,0,""]
["PRV Stations",null,null,null,null,null,null,null,0,""]
["Capital Spares",null,-565.22,0,0,0,0,0,0,"",0]
["Sanitation Infrastructure",null,{"$f":"SUM(C39:C44)","v":0},0,0,0,0,0,{"$f":"H38-G38","v":0},{"$f":"IF(I38=0,\"\",I38/H38)","v":""},{"$f":"SUM(K39:K44)","v":0}]
["Pump Station",null,null,null,null,null,null,null,0,""]
["Reticulation",null,null,null,null,null,null,null,{"$f":"H40-G40","v":0},{"$f":"IF(I40=0,\"\",I40/H40)","v":""}]
["Waste Water Treatment Works",null,null,null,null,null,null,null,{"$f":"H41-G41","v":0},{"$f":"IF(I41=0,\"\",I41/H41)","v":""}]
["Outfall Sewers",null,null,null,null,null,null,null,{"$f":"H42-G42","v":0},{"$f":"IF(I42=0,\"\",I42/H42)","v":""}]
["Toilet Facilities",null,null,null,null,null,null,null,0,""]
["Capital Spares",null,null,null,null,null,null,null,0,""]
["Solid Waste Infrastructure",null,{"$f":"SUM(C46:C52)","v":0},200000,200000,0,0,133336,{"$f":"H45-G45","v":133336},{"$f":"IF(I45=0,\"\",I45/H45)","v":1},{"$f":"SUM(K46:K52)","v":200000}]
["Landfill Sites",null,null,null,null,null,null,null,0,""]
["Waste Transfer Stations",null,null,null,null,null,null,null,0,""]
["Waste Processing Facilities",null,null,null,null,null,null,null,{"$f":"H48-G48","v":0},{"$f":"IF(I48=0,\"\",I48/H48)","v":""}]
["Waste Drop-off Points",null,null,null,null,null,null,null,0,""]
["Waste Separation Facilities",null,null,null,null,null,null,null,0,""]
["Electricity Generation Facilities",null,null,null,null,null,null,null,0,""]
["Capital Spares",null,0,200000,200000,0,0,133336,133336,1,200000]
["Rail Infrastructure",null,{"$f":"SUM(C54:C62)","v":0},0,0,0,0,0,0,"",{"$f":"SUM(K54:K62)","v":0}]
["Rail Lines",null,null,null,null,null,null,null,0,""]
["Rail Structures",null,null,null,null,null,null,null,0,""]
["Rail Furniture",null,null,null,null,null,null,null,0,""]
["Drainage Collection",null,null,null,null,null,null,null,0,""]
["Storm water Conveyance",null,null,null,null,null,null,null,0,""]
["Attenuation",null,null,null,null,null,null,null,0,""]
["MV Substations",null,null,null,null,null,null,null,0,""]
["LV Networks",null,null,null,null,null,null,null,0,""]
["Capital Spares",null,null,null,null,null,null,null,0,""]
["Coastal Infrastructure",null,{"$f":"SUM(C64:C68)","v":0},0,0,0,0,0,0,"",{"$f":"SUM(K64:K68)","v":0}]
["Sand Pumps",null,null,null,null,null,null,null,0,""]
["Piers",null,null,null,null,null,null,null,0,""]
["Revetments",null,null,null,null,null,null,null,0,""]
["Promenades",null,null,null,null,null,null,null,0,""]
["Capital Spares",null,null,null,null,null,null,null,0,""]
["Information and Communication Infrastructure",null,{"$f":"SUM(C70:C73)","v":0},0,0,0,0,0,{"$f":"H69-G69","v":0},{"$f":"IF(I69=0,\"\",I69/H69)","v":""},{"$f":"SUM(K70:K73)","v":0}]
["Data Centres",null,null,null,null,null,null,null,{"$f":"H70-G70","v":0},""]
["Core Layers",null,null,null,null,null,null,null,{"$f":"H71-G71","v":0},""]
["Distribution Layers",null,null,null,null,null,null,null,{"$f":"H72-G72","v":0},""]
["Capital Spares",null,null,null,null,null,null,null,{"$f":"H73-G73","v":0},""]
[null,null,null,null,null,null,null,null,null,""]
["Community Assets",null,{"$f":"+C76+C99","v":1055580.78},24243250,29347290,0,3679287.16,18550992,{"$f":"H75-G75","v":14871704.84},0.80166628501591719,{"$f":"+K76+K99","v":29347290}]
["Community Facilities",null,{"$f":"SUM(C77:C98)","v":1055580.78},18000000,20907540,0,3679287.16,13585524,{"$f":"H76-G76","v":9906236.8399999999},{"$f":"IF(I76=0,\"\",I76/H76)","v":0.72917591106533686},{"$f":"SUM(K77:K98)","v":20907540}]
["Halls",null,1055580.78,5000000,8407540,0,3679287.16,5018852,1339564.8399999999,0.2669066232676317,8407540]
["Centres",null,null,null,null,null,null,null,0,""]
["Crèches",null,0,0,0,0,0,0,0,"",0]
["Clinics/Care Centres",null,null,null,null,null,null,null,0,""]
["Fire/Ambulance Stations",null,null,null,null,null,null,null,0,""]
["Testing Stations",null,0,13000000,12500000,0,0,8566672,8566672,1,12500000]
["Museums",null,null,null,null,null,null,null,0,""]
["Galleries",null,null,null,null,null,null,null,0,""]
["Theatres",null,null,null,null,null,null,null,0,""]
["Libraries",null,null,null,null,null,null,null,0,""]
["Cemeteries/Crematoria",null,null,null,null,null,null,null,0,""]
["Police",null,null,null,null,null,null,null,{"$f":"H88-G88","v":0},{"$f":"IF(I88=0,\"\",I88/H88)","v":""}]
["Purls",null,null,null,null,null,null,null,0,""]
["Public Open Space",null,null,null,null,null,null,null,0,""]
["Nature Reserves",null,null,null,null,null,null,null,0,""]
["Public Ablution Facilities",null,null,null,null,null,null,null,0,""]
["Markets",null,null,null,null,null,null,null,0,""]
["Stalls",null,null,null,null,null,null,null,0,""]
["Abattoirs",null,null,null,null,null,null,null,0,""]
["Airports",null,null,null,null,null,null,null,0,""]
["Taxi Ranks/Bus Terminals",null,null,null,null,null,null,null,0,""]
["Capital Spares",null,null,null,null,null,null,null,0,""]
["Sport and Recreation Facilities",null,{"$f":"SUM(C100:C102)","v":0},6243250,8439750,0,0,4965468,4965468,1,{"$f":"SUM(K100:K102)","v":8439750}]
["Indoor Facilities",null,0,0,737717,0,0,511544,511544,1,737717]
["Outdoor Facilities",null,0,6243250,7702033,0,0,4453924,4453924,1,7702033]
["Capital Spares",null,null,null,null,null,null,null,0,""]
["Heritage assets",null,{"$f":"SUM(C104:C108)","v":0},0,0,0,0,0,0,"",{"$f":"SUM(K104:K108)","v":0}]
["Monuments",null,null,null,null,null,null,null,0,""]
["Historic Buildings",null,null,null,null,null,null,null,0,""]
["Works of Art",null,null,null,null,null,null,null,0,""]
["Conservation Areas",null,null,null,null,null,null,null,0,""]
["Other Heritage",null,null,null,null,null,null,null,0,""]
[null,null,null,null,null,null,null,null,0,""]
["Investment properties",null,{"$f":"+C111+C114","v":0},8000000,8000000,0,0,5333336,5333336,1,{"$f":"+K111+K114","v":8000000}]
["Revenue Generating",null,{"$f":"SUM(C112:C113)","v":0},0,0,0,0,0,0,"",{"$f":"SUM(K112:K113)","v":0}]
["Improved Property",null,null,null,null,null,null,null,0,""]
["Unimproved Property",null,null,null,null,null,null,null,0,""]
["Non-revenue Generating",null,{"$f":"SUM(C115:C116)","v":0},8000000,8000000,0,0,5333336,5333336,1,{"$f":"SUM(K115:K116)","v":8000000}]
["Improved Property",null,null,null,null,null,null,null,0,""]
["Unimproved Property",null,0,8000000,8000000,0,0,5333336,5333336,1,8000000]
["Other assets",null,{"$f":"+C118+C130","v":0},0,0,0,0,0,0,"",{"$f":"+K118+K130","v":0}]
["Operational Buildings",null,{"$f":"SUM(C119:C129)","v":0},0,0,0,0,0,0,"",{"$f":"SUM(K119:K129)","v":0}]
["Municipal Offices",null,0,0,0,0,0,0,0,"",0]
["Pay/Enquiry Points",null,null,null,null,null,null,null,0,{"$f":"IF(I120=0,\"\",I120/H120)","v":""}]
["Building Plan Offices",null,null,null,null,null,null,null,0,""]
["Workshops",null,null,null,null,null,null,null,0,""]
["Yards",null,null,null,null,null,null,null,0,""]
["Stores",null,null,null,null,null,null,null,0,""]
["Laboratories",null,null,null,null,null,null,null,0,""]
["Training Centres",null,null,null,null,null,null,null,0,""]
["Manufacturing Plant",null,null,null,null,null,null,null,0,""]
["Depots",null,null,null,null,null,null,null,0,""]
["Capital Spares",null,null,null,null,null,null,null,0,""]
["Housing",null,{"$f":"SUM(C131:C133)","v":0},0,0,0,0,0,0,"",{"$f":"SUM(K131:K133)","v":0}]
["Staff Housing",null,null,null,null,null,null,null,0,""]
["Social Housing",null,null,null,null,null,null,null,0,""]
["Capital Spares",null,null,null,null,null,null,null,0,""]
[null,null,null,null,null,null,null,null,null,""]
["Biological or Cultivated Assets",null,{"$f":"SUM(C136:C136)","v":0},0,0,0,0,0,{"$f":"H135-G135","v":0},"",{"$f":"SUM(K136)","v":0}]
["Biological or Cultivated Assets",null,null,null,null,null,null,null,{"$f":"H136-G136","v":0},""]
[null,null,null,null,null,null,null,null,null,""]
["Intangible Assets",null,{"$f":"SUM(C139:C140)","v":0},0,0,0,0,0,{"$f":"H138-G138","v":0},"",{"$f":"SUM(K139:K140)","v":0}]
["Servitudes",null,null,null,null,null,null,null,0,""]
["Licences and Rights",null,{"$f":"SUM(C141:C146)","v":0},0,0,0,0,0,0,"",{"$f":"SUM(K141:K146)","v":0}]
["Water Rights",null,null,null,null,null,null,null,0,""]
["Effluent Licenses",null,null,null,null,null,null,null,0,""]
["Solid Waste Licenses",null,null,null,null,null,null,null,0,""]
["Computer Software and Applications",null,null,null,null,null,null,null,0,""]
["Load Settlement Software Applications",null,null,null,null,null,null,null,0,""]
["Unspecified",null,null,null,null,null,null,null,0,""]
[]
["Computer Equipment",null,{"$f":"SUM(C149:C149)","v":0},1543000,2243000,38556,450217.56,1208672,{"$f":"H148-G148","v":758454.44},{"$f":"IF(I148=0,\"\",I148/H148)","v":0.62751055704111613},{"$f":"SUM(K149)","v":2243000}]
["Computer Equipment",null,0,1543000,2243000,38556,450217.56,1208672,{"$f":"H149-G149","v":758454.44},{"$f":"IF(I149=0,\"\",I149/H149)","v":0.62751055704111613},2243000]
[]
["Furniture and Office Equipment",null,{"$f":"SUM(C152:C152)","v":0},0,0,0,0,0,{"$f":"H151-G151","v":0},{"$f":"IF(I151=0,\"\",I151/H151)","v":""},{"$f":"SUM(K152)","v":0}]
["Furniture and Office Equipment",null,0,0,0,0,0,0,{"$f":"H152-G152","v":0},{"$f":"IF(I152=0,\"\",I152/H152)","v":""},0]
[null,null,null,null,null,null,null,null,null,{"$f":"IF(I153=0,\"\",I153/H153)","v":""}]
["Machinery and Equipment",null,{"$f":"SUM(C155:C155)","v":24205},1950000,3419000,227500,632462.5,2393800,{"$f":"H154-G154","v":1761337.5},{"$f":"IF(I154=0,\"\",I154/H154)","v":0.73579141950037596},{"$f":"SUM(K155)","v":3419000}]
["Machinery and Equipment",null,24205,1950000,3419000,227500,632462.5,2393800,{"$f":"H155-G155","v":1761337.5},{"$f":"IF(I155=0,\"\",I155/H155)","v":0.73579141950037596},3419000]
[]
["Transport Assets",null,{"$f":"SUM(C158:C158)","v":0},2200000,0,0,0,146664,{"$f":"H157-G157","v":146664},{"$f":"IF(I157=0,\"\",I157/H157)","v":1},{"$f":"SUM(K158)","v":0}]
["Transport Assets",null,0,2200000,0,0,0,146664,{"$f":"H158-G158","v":146664},{"$f":"IF(I158=0,\"\",I158/H158)","v":1},0]
[]
["Land",null,{"$f":"SUM(C161:C161)","v":0},0,0,0,0,0,{"$f":"H160-G160","v":0},{"$f":"IF(I160=0,\"\",I160/H160)","v":""},{"$f":"SUM(K161)","v":0}]
["Land",null,null,null,null,null,null,null,{"$f":"H161-G161","v":0},{"$f":"IF(I161=0,\"\",I161/H161)","v":""}]
[]
["Zoo's, Marine and Non-biological Animals",null,{"$f":"SUM(C164:C164)","v":0},0,0,0,0,0,{"$f":"H163-G163","v":0},{"$f":"IF(I163=0,\"\",I163/H163)","v":""},{"$f":"SUM(K164)","v":0}]
["Zoo's, Marine and Non-biological Animals",null,null,null,null,null,null,null,{"$f":"H164-G164","v":0},{"$f":"IF(I164=0,\"\",I164/H164)","v":""}]
[null,null,null,null,null,null,null,null,null,{"$f":"IF(I165=0,\"\",I165/H165)","v":""}]
["Total Capital Expenditure on new assets",1,{"$f":"C7+C75+C103+C110+C117+C135+C138+C148+C151+C154+C157+C160+C163","v":13766847.709999997},116386250,136987790,-865991.68999999971,19642990.73,91119172,{"$f":"H166-G166","v":71476181.269999996},{"$f":"IF(I166=0,\"\",I166/H166)","v":0.78442527188460398},{"$f":"K7+K75+K103+K110+K117+K135+K138+K148+K151+K154+K157+K160+K163","v":136987790}]
[]
[{"$f":"head27a","v":"References"}]
["1. Total Capital Expenditure on new assets (SC13a) plus Total Capital Expenditure on renewal of existing assets (SC13b) plus Total Capital Expenditure on upgrading of existing assets (SC13e)  must reconcile to total capital expenditure in Table C5"]
[]
["check balance",null,{"$f":"C166+SC13b!C166+SC13e!C166-'C5-Capex'!C40","v":0},{"$f":"D166+SC13b!D166+SC13e!D166-'C5-Capex'!D40","v":0},{"$f":"E166+SC13b!E166+SC13e!E166-'C5-Capex'!E40","v":0},{"$f":"F166+SC13b!F166+SC13e!F166-'C5-Capex'!F40","v":0},{"$f":"G166+SC13b!G166+SC13e!G166-'C5-Capex'!G40","v":0},{"$f":"H166+SC13b!H166+SC13e!H166-'C5-Capex'!H40","v":0},null,null,{"$f":"K166+SC13b!K166+SC13e!K166-'C5-Capex'!K40","v":0}]

{"sheet":"SC13b","index":30,"n_rows":171,"n_cols":11,"rows_kept":171,"cut":false,"hidden":false,"merged":[[0,0,0,10],[1,0,2,0],[1,1,2,1]]}
[{"$f":"muni& \" - \"&S71Sb& \" - \"&Head57","v":"LIM355 Lepelle-Nkumpi - Supporting Table SC13b Monthly Budget Statement - capital expenditure on renewal of existing assets by asset class - M08 February"}]
[{"$f":"desc","v":"Description"},{"$f":"head27","v":"Ref"},{"$f":"Head1","v":"2019/20"},{"$f":"Head2","v":"Budget Year 2020/21"}]
[null,null,{"$f":"Head5","v":"Audited Outcome"},{"$f":"Head6","v":"Original Budget"},{"$f":"Head7","v":"Adjusted Budget"},{"$f":"Head38","v":"Monthly actual"},{"$f":"Head39","v":"YearTD actual"},{"$f":"Head40","v":"YearTD budget"},{"$f":"Head41","v":"YTD variance"},{"$f":"Head41","v":"YTD variance"},{"$f":"Head8","v":"Full Year Forecast"}]
["R thousands",1,null,null,null,null,null,null,null,"%"]
["Capital expenditure on renewal of existing assets by Asset Class/Sub-class"]
[]
["Infrastructure",null,{"$f":"C8+C13+C17+C27+C38+C45+C53+C63+C69","v":0},3025000,4875000,-142046,0,3586664,{"$f":"H7-G7","v":3586664},{"$f":"IF(I7=0,\"\",I7/H7)","v":1},{"$f":"K8+K13+K17+K27+K38+K45+K53+K63+K69","v":4875000}]
["Roads Infrastructure",null,{"$f":"SUM(C9:C12)","v":0},2275000,4125000,-142046,0,3086664,3086664,1,{"$f":"SUM(K9:K12)","v":4125000}]
["Roads",null,null,null,null,null,null,null,0,""]
["Road Structures",null,0,2275000,4125000,-142046,0,3086664,3086664,1,4125000]
["Road Furniture",null,null,null,null,null,null,null,0,""]
["Capital Spares",null,null,null,null,null,null,null,0,""]
["Storm water Infrastructure",null,{"$f":"SUM(C14:C16)","v":0},0,0,0,0,0,0,"",{"$f":"SUM(K14:K16)","v":0}]
["Drainage Collection",null,null,null,null,null,null,null,0,""]
["Storm water Conveyance",null,null,null,null,null,null,null,0,""]
["Attenuation",null,null,null,null,null,null,null,0,""]
["Electrical Infrastructure",null,{"$f":"SUM(C18:C26)","v":0},750000,750000,0,0,500000,500000,1,{"$f":"SUM(K18:K26)","v":750000}]
["Power Plants",null,null,null,null,null,null,null,0,""]
["HV Substations",null,null,null,null,null,null,null,0,""]
["HV Switching Station",null,null,null,null,null,null,null,0,""]
["HV Transmission Conductors",null,null,null,null,null,null,null,0,""]
["MV Substations",null,null,null,null,null,null,null,0,""]
["MV Switching Stations",null,null,null,null,null,null,null,0,""]
["MV Networks",null,null,null,null,null,null,null,0,""]
["LV Networks",null,0,750000,750000,0,0,500000,500000,1,750000]
["Capital Spares",null,null,null,null,null,null,null,0,""]
["Water Supply Infrastructure",null,{"$f":"SUM(C28:C37)","v":0},0,0,0,0,0,0,"",{"$f":"SUM(K28:K37)","v":0}]
["Dams and Weirs",null,null,null,null,null,null,null,0,""]
["Boreholes",null,null,null,null,null,null,null,0,""]
["Reservoirs",null,null,null,null,null,null,null,0,""]
["Pump Stations",null,null,null,null,null,null,null,0,""]
["Water Treatment Works",null,null,null,null,null,null,null,0,""]
["Bulk Mains",null,null,null,null,null,null,null,0,""]
["Distribution",null,null,null,null,null,null,null,0,""]
["Distribution Points",null,null,null,null,null,null,null,0,""]
["PRV Stations",null,null,null,null,null,null,null,0,""]
["Capital Spares",null,null,null,null,null,null,null,0,""]
["Sanitation Infrastructure",null,{"$f":"SUM(C39:C44)","v":0},0,0,0,0,0,0,"",{"$f":"SUM(K39:K44)","v":0}]
["Pump Station",null,null,null,null,null,null,null,0,""]
["Reticulation",null,null,null,null,null,null,null,0,""]
["Waste Water Treatment Works",null,null,null,null,null,null,null,0,""]
["Outfall Sewers",null,null,null,null,null,null,null,0,""]
["Toilet Facilities",null,null,null,null,null,null,null,0,""]
["Capital Spares",null,null,null,null,null,null,null,0,""]
["Solid Waste Infrastructure",null,{"$f":"SUM(C46:C52)","v":0},0,0,0,0,0,0,"",{"$f":"SUM(K46:K52)","v":0}]
["Landfill Sites",null,null,null,null,null,null,null,0,""]
["Waste Transfer Stations",null,null,null,null,null,null,null,0,""]
["Waste Processing Facilities",null,null,null,null,null,null,null,0,""]
["Waste Drop-off Points",null,null,null,null,null,null,null,0,""]
["Waste Separation Facilities",null,null,null,null,null,null,null,0,""]
["Electricity Generation Facilities",null,null,null,null,null,null,null,0,""]
["Capital Spares",null,null,null,null,null,null,null,0,""]
["Rail Infrastructure",null,{"$f":"SUM(C54:C62)","v":0},0,0,0,0,0,0,"",{"$f":"SUM(K54:K62)","v":0}]
["Rail Lines",null,null,null,null,null,null,null,0,""]
["Rail Structures",null,null,null,null,null,null,null,0,""]
["Rail Furniture",null,null,null,null,null,null,null,0,""]
["Drainage Collection",null,null,null,null,null,null,null,0,""]
["Storm water Conveyance",null,null,null,null,null,null,null,0,""]
["Attenuation",null,null,null,null,null,null,null,0,""]
["MV Substations",null,null,null,null,null,null,null,0,""]
["LV Networks",null,null,null,null,null,null,null,0,""]
["Capital Spares",null,null,null,null,null,null,null,0,""]
["Coastal Infrastructure",null,{"$f":"SUM(C64:C68)","v":0},0,0,0,0,0,0,"",{"$f":"SUM(K64:K68)","v":0}]
["Sand Pumps",null,null,null,null,null,null,null,0,""]
["Piers",null,null,null,null,null,null,null,0,""]
["Revetments",null,null,null,null,null,null,null,0,""]
["Promenades",null,null,null,null,null,null,null,0,""]
["Capital Spares",null,null,null,null,null,null,null,0,""]
["Information and Communication Infrastructure",null,{"$f":"SUM(C70:C73)","v":0},0,0,0,0,0,0,"",{"$f":"SUM(K70:K73)","v":0}]
["Data Centres",null,null,null,null,null,null,null,0,""]
["Core Layers",null,null,null,null,null,null,null,0,""]
["Distribution Layers",null,null,null,null,null,null,null,0,""]
["Capital Spares",null,null,null,null,null,null,null,0,""]
[null,null,null,null,null,null,null,null,null,""]
["Community Assets",null,{"$f":"+C76+C99","v":0},5137000,5137000,0,0,3424664,3424664,1,{"$f":"+K76+K99","v":5137000}]
["Community Facilities",null,{"$f":"SUM(C77:C98)","v":0},0,0,0,0,0,0,"",{"$f":"SUM(K77:K98)","v":0}]
["Halls",null,0,0,0,0,0,0,0,"",0]
["Centres",null,null,null,null,null,null,null,0,""]
["Crèches",null,null,null,null,null,null,null,0,""]
["Clinics/Care Centres",null,null,null,null,null,null,null,0,""]
["Fire/Ambulance Stations",null,null,null,null,null,null,null,0,""]
["Testing Stations",null,null,null,null,null,null,null,0,""]
["Museums",null,null,null,null,null,null,null,0,""]
["Galleries",null,null,null,null,null,null,null,0,""]
["Theatres",null,null,null,null,null,null,null,0,""]
["Libraries",null,null,null,null,null,null,null,0,""]
["Cemeteries/Crematoria",null,null,null,null,null,null,null,0,""]
["Police",null,null,null,null,null,null,null,0,""]
["Purls",null,null,null,null,null,null,null,0,""]
["Public Open Space",null,null,null,null,null,null,null,0,""]
["Nature Reserves",null,null,null,null,null,null,null,0,""]
["Public Ablution Facilities",null,null,null,null,null,null,null,0,""]
["Markets",null,null,null,null,null,null,null,0,""]
["Stalls",null,null,null,null,null,null,null,0,""]
["Abattoirs",null,null,null,null,null,null,null,0,""]
["Airports",null,null,null,null,null,null,null,0,""]
["Taxi Ranks/Bus Terminals",null,null,null,null,null,null,null,0,""]
["Capital Spares",null,null,null,null,null,null,null,0,""]
["Sport and Recreation Facilities",null,{"$f":"SUM(C100:C102)","v":0},5137000,5137000,0,0,3424664,3424664,1,{"$f":"SUM(K100:K102)","v":5137000}]
["Indoor Facilities",null,null,null,null,null,null,null,0,""]
["Outdoor Facilities",null,0,5137000,5137000,0,0,3424664,{"$f":"H101-G101","v":3424664},{"$f":"IF(I101=0,\"\",I101/H101)","v":1},5137000]
["Capital Spares",null,null,null,null,null,null,null,0,""]
["Heritage assets",null,{"$f":"SUM(C104:C108)","v":0},0,0,0,0,0,0,"",{"$f":"SUM(K104:K108)","v":0}]
["Monuments",null,null,null,null,null,null,null,0,""]
["Historic Buildings",null,null,null,null,null,null,null,0,""]
["Works of Art",null,null,null,null,null,null,null,0,""]
["Conservation Areas",null,null,null,null,null,null,null,0,""]
["Other Heritage",null,null,null,null,null,null,null,0,""]
[null,null,null,null,null,null,null,null,0,""]
["Investment properties",null,{"$f":"+C111+C114","v":0},0,0,0,0,0,0,"",{"$f":"+K111+K114","v":0}]
["Revenue Generating",null,{"$f":"SUM(C112:C113)","v":0},0,0,0,0,0,0,"",{"$f":"SUM(K112:K113)","v":0}]
["Improved Property",null,null,null,null,null,null,null,0,""]
["Unimproved Property",null,null,null,null,null,null,null,0,""]
["Non-revenue Generating",null,{"$f":"SUM(C115:C116)","v":0},0,0,0,0,0,0,"",{"$f":"SUM(K115:K116)","v":0}]
["Improved Property",null,null,null,null,null,null,null,0,""]
["Unimproved Property",null,null,null,null,null,null,null,{"$f":"H116-G116","v":0},{"$f":"IF(I116=0,\"\",I116/H116)","v":""}]
["Other assets",null,{"$f":"+C118+C130","v":0},0,0,0,0,0,0,"",{"$f":"+K118+K130","v":0}]
["Operational Buildings",null,{"$f":"SUM(C119:C129)","v":0},0,0,0,0,0,0,"",{"$f":"SUM(K119:K129)","v":0}]
["Municipal Offices",null,null,null,null,null,null,null,0,""]
["Pay/Enquiry Points",null,null,null,null,null,null,null,0,""]
["Building Plan Offices",null,null,null,null,null,null,null,0,""]
["Workshops",null,null,null,null,null,null,null,0,""]
["Yards",null,null,null,null,null,null,null,0,""]
["Stores",null,null,null,null,null,null,null,0,""]
["Laboratories",null,null,null,null,null,null,null,0,""]
["Training Centres",null,null,null,null,null,null,null,0,""]
["Manufacturing Plant",null,null,null,null,null,null,null,0,""]
["Depots",null,null,null,null,null,null,null,0,""]
["Capital Spares",null,null,null,null,null,null,null,0,""]
["Housing",null,{"$f":"SUM(C131:C133)","v":0},0,0,0,0,0,0,"",{"$f":"SUM(K131:K133)","v":0}]
["Staff Housing",null,null,null,null,null,null,null,0,""]
["Social Housing",null,null,null,null,null,null,null,0,""]
["Capital Spares",null,null,null,null,null,null,null,0,""]
[null,null,null,null,null,null,null,null,null,""]
["Biological or Cultivated Assets",null,{"$f":"SUM(C136:C136)","v":0},0,0,0,0,0,{"$f":"H135-G135","v":0},"",{"$f":"SUM(K136)","v":0}]
["Biological or Cultivated Assets",null,null,null,null,null,null,null,{"$f":"H136-G136","v":0},""]
[null,null,null,null,null,null,null,null,null,{"$f":"IF(I137=0,\"\",I137/H137)","v":""}]
["Intangible Assets",null,{"$f":"SUM(C139:C140)","v":0},0,0,0,0,0,{"$f":"H138-G138","v":0},"",{"$f":"SUM(K139:K140)","v":0}]
["Servitudes",null,null,null,null,null,null,null,0,""]
["Licences and Rights",null,{"$f":"SUM(C141:C146)","v":0},0,0,0,0,0,0,"",{"$f":"SUM(K141:K146)","v":0}]
["Water Rights",null,null,null,null,null,null,null,0,""]
["Effluent Licenses",null,null,null,null,null,null,null,0,""]
["Solid Waste Licenses",null,null,null,null,null,null,null,0,""]
["Computer Software and Applications",null,null,null,null,null,null,null,0,""]
["Load Settlement Software Applications",null,null,null,null,null,null,null,0,""]
["Unspecified",null,null,null,null,null,null,null,0,""]
[]
["Computer Equipment",null,{"$f":"SUM(C149:C149)","v":0},0,0,0,0,0,{"$f":"H148-G148","v":0},{"$f":"IF(I148=0,\"\",I148/H148)","v":""},{"$f":"SUM(K149)","v":0}]
["Computer Equipment",null,null,null,null,null,null,null,{"$f":"H149-G149","v":0},{"$f":"IF(I149=0,\"\",I149/H149)","v":""}]
[]
["Furniture and Office Equipment",null,{"$f":"SUM(C152:C152)","v":0},0,0,0,0,0,{"$f":"H151-G151","v":0},{"$f":"IF(I151=0,\"\",I151/H151)","v":""},{"$f":"SUM(K152)","v":0}]
["Furniture and Office Equipment",null,null,null,null,null,null,null,{"$f":"H152-G152","v":0},{"$f":"IF(I152=0,\"\",I152/H152)","v":""}]
[null,null,null,null,null,null,null,null,null,{"$f":"IF(I153=0,\"\",I153/H153)","v":""}]
["Machinery and Equipment",null,{"$f":"SUM(C155:C155)","v":0},520000,520000,0,7800,346664,{"$f":"H154-G154","v":338864},{"$f":"IF(I154=0,\"\",I154/H154)","v":0.97749982692174553},{"$f":"SUM(K155)","v":520000}]
["Machinery and Equipment",null,0,520000,520000,0,7800,346664,{"$f":"H155-G155","v":338864},{"$f":"IF(I155=0,\"\",I155/H155)","v":0.97749982692174553},520000]
[]
["Transport Assets",null,{"$f":"SUM(C158:C158)","v":0},0,0,0,0,0,{"$f":"H157-G157","v":0},{"$f":"IF(I157=0,\"\",I157/H157)","v":""},{"$f":"SUM(K158)","v":0}]
["Transport Assets",null,null,null,null,null,null,null,{"$f":"H158-G158","v":0},{"$f":"IF(I158=0,\"\",I158/H158)","v":""}]
[]
["Land",null,{"$f":"SUM(C161:C161)","v":0},0,0,0,0,0,{"$f":"H160-G160","v":0},{"$f":"IF(I160=0,\"\",I160/H160)","v":""},{"$f":"SUM(K161)","v":0}]
["Land",null,null,null,null,null,null,null,{"$f":"H161-G161","v":0},{"$f":"IF(I161=0,\"\",I161/H161)","v":""}]
[null,null,null,null,null,null,null,null,null,"."]
["Zoo's, Marine and Non-biological Animals",null,{"$f":"SUM(C164:C164)","v":0},0,0,0,0,0,{"$f":"H163-G163","v":0},{"$f":"IF(I163=0,\"\",I163/H163)","v":""},{"$f":"SUM(K164)","v":0}]
["Zoo's, Marine and Non-biological Animals",null,null,null,null,null,null,null,{"$f":"H164-G164","v":0},{"$f":"IF(I164=0,\"\",I164/H164)","v":""}]
[null,null,null,null,null,null,null,null,null,{"$f":"IF(I165=0,\"\",I165/H165)","v":""}]
["Total Capital Expenditure on renewal of existing assets ",1,{"$f":"C7+C75+C103+C110+C117+C135+C138+C148+C151+C154+C157+C160+C163","v":0},8682000,10532000,-142046,7800,7357992,{"$f":"H166-G166","v":7350192},{"$f":"IF(I166=0,\"\",I166/H166)","v":0.9989399281760567},{"$f":"K7+K75+K103+K110+K117+K135+K138+K148+K151+K154+K157+K160+K163","v":10532000}]
[]
[{"$f":"head27a","v":"References"}]
["1. Total Capital Expenditure on new assets (SC13a) plus Total Capital Expenditure on renewal of existing assets (SC13b) plus Total Capital Expenditure on upgrading of existing assets (SC13e) must reconcile to total capital expenditure in Table C5"]
[]
["check balance",null,{"$f":"C166+SC13a!C166+SC13e!C166-'C5-Capex'!C40","v":0},{"$f":"D166+SC13a!D166+SC13e!D166-'C5-Capex'!D40","v":0},{"$f":"E166+SC13a!E166+SC13e!E166-'C5-Capex'!E40","v":0},{"$f":"F166+SC13a!F166+SC13e!F166-'C5-Capex'!F40","v":0},{"$f":"G166+SC13a!G166+SC13e!G166-'C5-Capex'!G40","v":0},{"$f":"H166+SC13a!H166+SC13e!H166-'C5-Capex'!H40","v":0},null,null,{"$f":"K166+SC13a!K166+SC13e!K166-'C5-Capex'!K40","v":0}]

{"sheet":"SC13c","index":31,"n_rows":166,"n_cols":11,"rows_kept":166,"cut":false,"hidden":false,"merged":[[0,0,0,10],[1,0,2,0],[1,1,2,1]]}
[{"$f":"muni& \" - \"&S71Sc& \" - \"&Head57","v":"LIM355 Lepelle-Nkumpi - Supporting Table SC13c Monthly Budget Statement - expenditure on repairs and maintenance by asset class - M08 February"}]
[{"$f":"desc","v":"Description"},{"$f":"head27","v":"Ref"},{"$f":"Head1","v":"2019/20"},{"$f":"Head2","v":"Budget Year 2020/21"}]
[null,null,{"$f":"Head5","v":"Audited Outcome"},{"$f":"Head6","v":"Original Budget"},{"$f":"Head7","v":"Adjusted Budget"},{"$f":"Head38","v":"Monthly actual"},{"$f":"Head39","v":"YearTD actual"},{"$f":"Head40","v":"YearTD budget"},{"$f":"Head41","v":"YTD variance"},{"$f":"Head41","v":"YTD variance"},{"$f":"Head8","v":"Full Year Forecast"}]
["R thousands",1,null,null,null,null,null,null,null,"%"]
["Repairs and maintenance expenditure by Asset Class/Sub-class"]
[]
["Infrastructure",null,{"$f":"C8+C13+C17+C27+C38+C45+C53+C63+C69","v":487500},1900000,12311384,2009.52,59169.270000000004,4241615,{"$f":"H7-G7","v":4182445.73},{"$f":"IF(I7=0,\"\",I7/H7)","v":0.98605029687984413},{"$f":"K8+K13+K17+K27+K38+K45+K53+K63+K69","v":12311384}]
["Roads Infrastructure",null,{"$f":"SUM(C9:C12)","v":487500},600000,7011384,2009.52,27895.57,2649386,2621490.4300000002,0.98947093024572497,{"$f":"SUM(K9:K12)","v":7011384}]
["Roads",null,487500,600000,6359114,969.52,26855.57,2511822,2484966.4300000002,0.98930833076547631,6359114]
["Road Structures",null,null,null,null,null,null,null,0,""]
["Road Furniture",null,0,0,652270,1040,1040,137564,136524,0.99243988252740545,652270]
["Capital Spares",null,null,null,null,null,null,null,0,""]
["Storm water Infrastructure",null,{"$f":"SUM(C14:C16)","v":0},0,0,0,0,0,0,"",{"$f":"SUM(K14:K16)","v":0}]
["Drainage Collection",null,null,null,null,null,null,null,0,""]
["Storm water Conveyance",null,null,null,null,null,null,null,0,""]
["Attenuation",null,null,null,null,null,null,null,0,""]
["Electrical Infrastructure",null,{"$f":"SUM(C18:C26)","v":0},1300000,5300000,0,31273.7,1592229,1560955.3,0.9803585413907171,{"$f":"SUM(K18:K26)","v":5300000}]
["Power Plants",null,null,null,null,null,null,null,0,""]
["HV Substations",null,null,null,null,null,null,null,0,""]
["HV Switching Station",null,null,null,null,null,null,null,0,""]
["HV Transmission Conductors",null,null,null,null,null,null,null,0,""]
["MV Substations",null,null,null,null,null,null,null,0,""]
["MV Switching Stations",null,null,null,null,null,null,null,0,""]
["MV Networks",null,0,400000,2500000,0,31273.7,826664,795390.3,0.96216878925415894,2500000]
["LV Networks",null,null,null,null,null,null,null,0,""]
["Capital Spares",null,0,900000,2800000,0,0,765565,765565,1,2800000]
["Water Supply Infrastructure",null,{"$f":"SUM(C28:C37)","v":0},0,0,0,0,0,0,"",{"$f":"SUM(K28:K37)","v":0}]
["Dams and Weirs",null,null,null,null,null,null,null,0,""]
["Boreholes",null,null,null,null,null,null,null,0,""]
["Reservoirs",null,null,null,null,null,null,null,0,""]
["Pump Stations",null,null,null,null,null,null,null,0,""]
["Water Treatment Works",null,null,null,null,null,null,null,0,""]
["Bulk Mains",null,null,null,null,null,null,null,0,""]
["Distribution",null,null,null,null,null,null,null,0,""]
["Distribution Points",null,null,null,null,null,null,null,0,""]
["PRV Stations",null,null,null,null,null,null,null,0,""]
["Capital Spares",null,null,null,null,null,null,null,0,""]
["Sanitation Infrastructure",null,{"$f":"SUM(C39:C44)","v":0},0,0,0,0,0,0,"",{"$f":"SUM(K39:K44)","v":0}]
["Pump Station",null,null,null,null,null,null,null,0,""]
["Reticulation",null,null,null,null,null,null,null,0,""]
["Waste Water Treatment Works",null,null,null,null,null,null,null,0,""]
["Outfall Sewers",null,null,null,null,null,null,null,0,""]
["Toilet Facilities",null,null,null,null,null,null,null,0,""]
["Capital Spares",null,null,null,null,null,null,null,0,""]
["Solid Waste Infrastructure",null,{"$f":"SUM(C46:C52)","v":0},0,0,0,0,0,0,"",{"$f":"SUM(K46:K52)","v":0}]
["Landfill Sites",null,null,null,null,null,null,null,0,""]
["Waste Transfer Stations",null,null,null,null,null,null,null,0,""]
["Waste Processing Facilities",null,null,null,null,null,null,null,0,""]
["Waste Drop-off Points",null,null,null,null,null,null,null,0,""]
["Waste Separation Facilities",null,null,null,null,null,null,null,0,""]
["Electricity Generation Facilities",null,null,null,null,null,null,null,0,""]
["Capital Spares",null,null,null,null,null,null,null,0,""]
["Rail Infrastructure",null,{"$f":"SUM(C54:C62)","v":0},0,0,0,0,0,0,"",{"$f":"SUM(K54:K62)","v":0}]
["Rail Lines",null,null,null,null,null,null,null,0,""]
["Rail Structures",null,null,null,null,null,null,null,0,""]
["Rail Furniture",null,null,null,null,null,null,null,0,""]
["Drainage Collection",null,null,null,null,null,null,null,0,""]
["Storm water Conveyance",null,null,null,null,null,null,null,0,""]
["Attenuation",null,null,null,null,null,null,null,0,""]
["MV Substations",null,null,null,null,null,null,null,0,""]
["LV Networks",null,null,null,null,null,null,null,0,""]
["Capital Spares",null,null,null,null,null,null,null,0,""]
["Coastal Infrastructure",null,{"$f":"SUM(C64:C68)","v":0},0,0,0,0,0,0,"",{"$f":"SUM(K64:K68)","v":0}]
["Sand Pumps",null,null,null,null,null,null,null,0,""]
["Piers",null,null,null,null,null,null,null,0,""]
["Revetments",null,null,null,null,null,null,null,0,""]
["Promenades",null,null,null,null,null,null,null,0,""]
["Capital Spares",null,null,null,null,null,null,null,0,""]
["Information and Communication Infrastructure",null,{"$f":"SUM(C70:C73)","v":0},0,0,0,0,0,0,"",{"$f":"SUM(K70:K73)","v":0}]
["Data Centres",null,null,null,null,null,null,null,0,""]
["Core Layers",null,null,null,null,null,null,null,0,""]
["Distribution Layers",null,null,null,null,null,null,null,0,""]
["Capital Spares",null,null,null,null,null,null,null,0,""]
[null,null,null,null,null,null,null,null,null,""]
["Community Assets",null,{"$f":"+C76+C99","v":0},100000,383545,0,0,123373,123373,1,{"$f":"+K76+K99","v":383545}]
["Community Facilities",null,{"$f":"SUM(C77:C98)","v":0},100000,383545,0,0,123373,123373,1,{"$f":"SUM(K77:K98)","v":383545}]
["Halls",null,0,0,0,0,0,0,0,"",0]
["Centres",null,0,100000,383545,0,0,123373,123373,1,383545]
["Crèches",null,0,0,0,0,0,0,0,"",0]
["Clinics/Care Centres",null,null,null,null,null,null,null,0,""]
["Fire/Ambulance Stations",null,null,null,null,null,null,null,0,""]
["Testing Stations",null,null,null,null,null,null,null,0,""]
["Museums",null,null,null,null,null,null,null,0,""]
["Galleries",null,null,null,null,null,null,null,0,""]
["Theatres",null,null,null,null,null,null,null,0,""]
["Libraries",null,null,null,null,null,null,null,0,""]
["Cemeteries/Crematoria",null,0,0,0,0,0,0,0,"",0]
["Police",null,null,null,null,null,null,null,0,""]
["Purls",null,0,0,0,0,0,0,0,"",0]
["Public Open Space",null,null,null,null,null,null,null,0,""]
["Nature Reserves",null,null,null,null,null,null,null,0,""]
["Public Ablution Facilities",null,null,null,null,null,null,null,0,""]
["Markets",null,null,null,null,null,null,null,0,""]
["Stalls",null,null,null,null,null,null,null,0,""]
["Abattoirs",null,null,null,null,null,null,null,0,""]
["Airports",null,null,null,null,null,null,null,0,""]
["Taxi Ranks/Bus Terminals",null,null,null,null,null,null,null,0,""]
["Capital Spares",null,null,null,null,null,null,null,0,""]
["Sport and Recreation Facilities",null,{"$f":"SUM(C100:C102)","v":0},0,0,0,0,0,0,"",{"$f":"SUM(K100:K102)","v":0}]
["Indoor Facilities",null,null,null,null,null,null,null,0,""]
["Outdoor Facilities",null,0,0,0,0,0,0,{"$f":"H101-G101","v":0},{"$f":"IF(I101=0,\"\",I101/H101)","v":""},0]
["Capital Spares",null,null,null,null,null,null,null,0,""]
["Heritage assets",null,{"$f":"SUM(C104:C108)","v":0},0,0,0,0,0,0,"",{"$f":"SUM(K104:K108)","v":0}]
["Monuments",null,null,null,null,null,null,null,0,""]
["Historic Buildings",null,null,null,null,null,null,null,0,""]
["Works of Art",null,null,null,null,null,null,null,0,""]
["Conservation Areas",null,null,null,null,null,null,null,0,""]
["Other Heritage",null,null,null,null,null,null,null,0,""]
[null,null,null,null,null,null,null,null,0,""]
["Investment properties",null,{"$f":"+C111+C114","v":0},0,0,0,0,0,0,"",{"$f":"+K111+K114","v":0}]
["Revenue Generating",null,{"$f":"SUM(C112:C113)","v":0},0,0,0,0,0,0,"",{"$f":"SUM(K112:K113)","v":0}]
["Improved Property",null,null,null,null,null,null,null,0,""]
["Unimproved Property",null,null,null,null,null,null,null,0,""]
["Non-revenue Generating",null,{"$f":"SUM(C115:C116)","v":0},0,0,0,0,0,0,"",{"$f":"SUM(K115:K116)","v":0}]
["Improved Property",null,null,null,null,null,null,null,0,""]
["Unimproved Property",null,null,null,null,null,null,null,{"$f":"H116-G116","v":0},{"$f":"IF(I116=0,\"\",I116/H116)","v":""}]
["Other assets",null,{"$f":"+C118+C130","v":0},900000,1200000,0,146672.78,900000,753327.22,0.8370302444444444,{"$f":"+K118+K130","v":1200000}]
["Operational Buildings",null,{"$f":"SUM(C119:C129)","v":0},900000,1200000,0,146672.78,900000,753327.22,0.8370302444444444,{"$f":"SUM(K119:K129)","v":1200000}]
["Municipal Offices",null,0,900000,1200000,0,146672.78,900000,753327.22,0.8370302444444444,1200000]
["Pay/Enquiry Points",null,null,null,null,null,null,null,0,""]
["Building Plan Offices",null,null,null,null,null,null,null,0,""]
["Workshops",null,null,null,null,null,null,null,0,""]
["Yards",null,null,null,null,null,null,null,0,""]
["Stores",null,null,null,null,null,null,null,0,""]
["Laboratories",null,null,null,null,null,null,null,0,""]
["Training Centres",null,null,null,null,null,null,null,0,""]
["Manufacturing Plant",null,null,null,null,null,null,null,0,""]
["Depots",null,null,null,null,null,null,null,0,""]
["Capital Spares",null,null,null,null,null,null,null,0,""]
["Housing",null,{"$f":"SUM(C131:C133)","v":0},0,0,0,0,0,0,"",{"$f":"SUM(K131:K133)","v":0}]
["Staff Housing",null,null,null,null,null,null,null,0,""]
["Social Housing",null,null,null,null,null,null,null,0,""]
["Capital Spares",null,null,null,null,null,null,null,0,""]
[null,null,null,null,null,null,null,null,null,""]
["Biological or Cultivated Assets",null,{"$f":"SUM(C136:C136)","v":0},0,0,0,0,0,{"$f":"H135-G135","v":0},"",{"$f":"SUM(K136)","v":0}]
["Biological or Cultivated Assets",null,null,null,null,null,null,null,{"$f":"H136-G136","v":0},""]
[null,null,null,null,null,null,null,null,null,{"$f":"IF(I137=0,\"\",I137/H137)","v":""}]
["Intangible Assets",null,{"$f":"SUM(C139:C140)","v":0},0,0,0,0,266665,{"$f":"H138-G138","v":266665},1,{"$f":"SUM(K139:K140)","v":0}]
["Servitudes",null,null,null,null,null,null,null,0,""]
["Licences and Rights",null,{"$f":"SUM(C141:C146)","v":0},0,0,0,0,266665,266665,1,{"$f":"SUM(K141:K146)","v":0}]
["Water Rights",null,null,null,null,null,null,null,0,""]
["Effluent Licenses",null,null,null,null,null,null,null,0,""]
["Solid Waste Licenses",null,null,null,null,null,null,null,0,""]
["Computer Software and Applications",null,0,0,0,0,0,0,0,"",0]
["Load Settlement Software Applications",null,null,null,null,null,null,null,0,""]
["Unspecified",null,0,0,0,0,0,266665,266665,1,0]
[]
["Computer Equipment",null,{"$f":"SUM(C149:C149)","v":0},0,0,0,0,0,{"$f":"H148-G148","v":0},{"$f":"IF(I148=0,\"\",I148/H148)","v":""},{"$f":"SUM(K149)","v":0}]
["Computer Equipment",null,null,null,null,null,null,null,{"$f":"H149-G149","v":0},{"$f":"IF(I149=0,\"\",I149/H149)","v":""}]
[]
["Furniture and Office Equipment",null,{"$f":"SUM(C152:C152)","v":0},0,0,0,0,0,{"$f":"H151-G151","v":0},{"$f":"IF(I151=0,\"\",I151/H151)","v":""},{"$f":"SUM(K152)","v":0}]
["Furniture and Office Equipment",null,null,null,null,null,null,null,{"$f":"H152-G152","v":0},{"$f":"IF(I152=0,\"\",I152/H152)","v":""}]
[null,null,null,null,null,null,null,null,null,{"$f":"IF(I153=0,\"\",I153/H153)","v":""}]
["Machinery and Equipment",null,{"$f":"SUM(C155:C155)","v":0},0,0,0,0,0,{"$f":"H154-G154","v":0},{"$f":"IF(I154=0,\"\",I154/H154)","v":""},{"$f":"SUM(K155)","v":0}]
["Machinery and Equipment",null,0,0,0,0,0,0,{"$f":"H155-G155","v":0},{"$f":"IF(I155=0,\"\",I155/H155)","v":""},0]
[]
["Transport Assets",null,{"$f":"SUM(C158:C158)","v":30723.439999999999},400000,400000,14456.96,187004.88,266664,{"$f":"H157-G157","v":79659.12},{"$f":"IF(I157=0,\"\",I157/H157)","v":0.29872468724687246},{"$f":"SUM(K158)","v":400000}]
["Transport Assets",null,30723.439999999999,400000,400000,14456.96,187004.88,266664,{"$f":"H158-G158","v":79659.12},{"$f":"IF(I158=0,\"\",I158/H158)","v":0.29872468724687246},400000]
[]
["Land",null,{"$f":"SUM(C161:C161)","v":0},0,0,0,0,0,{"$f":"H160-G160","v":0},{"$f":"IF(I160=0,\"\",I160/H160)","v":""},{"$f":"SUM(K161)","v":0}]
["Land",null,null,null,null,null,null,null,{"$f":"H161-G161","v":0},{"$f":"IF(I161=0,\"\",I161/H161)","v":""}]
[]
["Zoo's, Marine and Non-biological Animals",null,{"$f":"SUM(C164:C164)","v":0},0,0,0,0,0,{"$f":"H163-G163","v":0},{"$f":"IF(I163=0,\"\",I163/H163)","v":""},{"$f":"SUM(K164)","v":0}]
["Zoo's, Marine and Non-biological Animals",null,null,null,null,null,null,null,{"$f":"H164-G164","v":0},{"$f":"IF(I164=0,\"\",I164/H164)","v":""}]
[null,null,null,null,null,null,null,null,null,{"$f":"IF(I165=0,\"\",I165/H165)","v":""}]
["Total Repairs and Maintenance Expenditure",1,{"$f":"C7+C75+C103+C110+C117+C135+C138+C148+C151+C154+C157+C160+C163","v":518223.44},3300000,14294929,16466.48,392846.93,5798317,5405470.0700000003,0.93224811096047355,{"$f":"K7+K75+K103+K110+K117+K135+K138+K148+K151+K154+K157+K160+K163","v":14294929}]

{"sheet":"SC13d","index":32,"n_rows":166,"n_cols":11,"rows_kept":166,"cut":false,"hidden":false,"merged":[[0,0,0,10],[1,0,2,0],[1,1,2,1]]}
[{"$f":"muni& \" - \"&S71Sd& \" - \"&Head57","v":"LIM355 Lepelle-Nkumpi - Supporting Table SC13d Monthly Budget Statement - depreciation by asset class - M08 February"}]
[{"$f":"desc","v":"Description"},{"$f":"head27","v":"Ref"},{"$f":"Head1","v":"2019/20"},{"$f":"Head2","v":"Budget Year 2020/21"}]
[null,null,{"$f":"Head5","v":"Audited Outcome"},{"$f":"Head6","v":"Original Budget"},{"$f":"Head7","v":"Adjusted Budget"},{"$f":"Head38","v":"Monthly actual"},{"$f":"Head39","v":"YearTD actual"},{"$f":"Head40","v":"YearTD budget"},{"$f":"Head41","v":"YTD variance"},{"$f":"Head41","v":"YTD variance"},{"$f":"Head8","v":"Full Year Forecast"}]
["R thousands",1,null,null,null,null,null,null,null,"%"]
["Depreciation by Asset Class/Sub-class"]
[]
["Infrastructure",null,{"$f":"C8+C13+C17+C27+C38+C45+C53+C63+C69","v":0},7598910,16450910,1151771.28,9214170.2599999998,6836344,{"$f":"H7-G7","v":-2377826.2599999998},{"$f":"IF(I7=0,\"\",I7/H7)","v":-0.34782132964637236},{"$f":"K8+K13+K17+K27+K38+K45+K53+K63+K69","v":16450910}]
["Roads Infrastructure",null,{"$f":"SUM(C9:C12)","v":0},5747530,14519530,991542.26,7932338.0899999999,5586088,-2346250.09,-0.42001667177459429,{"$f":"SUM(K9:K12)","v":14519530}]
["Roads",null,0,5747530,14519530,991542.26,7932338.0899999999,5586088,-2346250.09,-0.42001667177459429,14519530]
["Road Structures",null,null,null,null,null,null,null,0,""]
["Road Furniture",null,null,null,null,null,null,null,0,""]
["Capital Spares",null,null,null,null,null,null,null,0,""]
["Storm water Infrastructure",null,{"$f":"SUM(C14:C16)","v":0},0,0,0,0,0,0,"",{"$f":"SUM(K14:K16)","v":0}]
["Drainage Collection",null,0,0,0,0,0,0,0,"",0]
["Storm water Conveyance",null,null,null,null,null,null,null,0,""]
["Attenuation",null,null,null,null,null,null,null,0,""]
["Electrical Infrastructure",null,{"$f":"SUM(C18:C26)","v":0},1216019,1316019,109488.96000000001,875911.68000000005,830680,-45231.680000000051,-5.445138922328701E-2,{"$f":"SUM(K18:K26)","v":1316019}]
["Power Plants",null,0,0,0,0,0,0,0,"",0]
["HV Substations",null,null,null,null,null,null,null,0,""]
["HV Switching Station",null,null,null,null,null,null,null,0,""]
["HV Transmission Conductors",null,null,null,null,null,null,null,0,""]
["MV Substations",null,null,null,null,null,null,null,0,""]
["MV Switching Stations",null,null,null,null,null,null,null,0,""]
["MV Networks",null,0,0,0,0,0,0,0,"",0]
["LV Networks",null,0,1216019,1316019,109488.96000000001,875911.68000000005,830680,-45231.680000000051,-5.445138922328701E-2,1316019]
["Capital Spares",null,null,null,null,null,null,null,0,""]
["Water Supply Infrastructure",null,{"$f":"SUM(C28:C37)","v":0},0,0,0,0,0,0,"",{"$f":"SUM(K28:K37)","v":0}]
["Dams and Weirs",null,0,0,0,0,0,0,0,"",0]
["Boreholes",null,null,null,null,null,null,null,0,""]
["Reservoirs",null,null,null,null,null,null,null,0,""]
["Pump Stations",null,null,null,null,null,null,null,0,""]
["Water Treatment Works",null,null,null,null,null,null,null,0,""]
["Bulk Mains",null,null,null,null,null,null,null,0,""]
["Distribution",null,null,null,null,null,null,null,0,""]
["Distribution Points",null,null,null,null,null,null,null,0,""]
["PRV Stations",null,null,null,null,null,null,null,0,""]
["Capital Spares",null,0,0,0,0,0,0,0,"",0]
["Sanitation Infrastructure",null,{"$f":"SUM(C39:C44)","v":0},0,0,0,0,0,0,"",{"$f":"SUM(K39:K44)","v":0}]
["Pump Station",null,null,null,null,null,null,null,0,""]
["Reticulation",null,null,null,null,null,null,null,0,""]
["Waste Water Treatment Works",null,null,null,null,null,null,null,0,""]
["Outfall Sewers",null,null,null,null,null,null,null,0,""]
["Toilet Facilities",null,null,null,null,null,null,null,0,""]
["Capital Spares",null,null,null,null,null,null,null,0,""]
["Solid Waste Infrastructure",null,{"$f":"SUM(C46:C52)","v":0},635361,615361,50740.060000000005,405920.49,419576,13655.510000000009,3.2545974984269858E-2,{"$f":"SUM(K46:K52)","v":615361}]
["Landfill Sites",null,0,539743,519743,43145.73,345165.85,355832,10666.150000000023,2.9975241125025358E-2,519743]
["Waste Transfer Stations",null,0,95618,95618,7594.33,60754.64,63744,2989.3600000000006,4.6896335341365468E-2,95618]
["Waste Processing Facilities",null,null,null,null,null,null,null,0,""]
["Waste Drop-off Points",null,null,null,null,null,null,null,0,""]
["Waste Separation Facilities",null,null,null,null,null,null,null,0,""]
["Electricity Generation Facilities",null,null,null,null,null,null,null,0,""]
["Capital Spares",null,null,null,null,null,null,null,0,""]
["Rail Infrastructure",null,{"$f":"SUM(C54:C62)","v":0},0,0,0,0,0,0,"",{"$f":"SUM(K54:K62)","v":0}]
["Rail Lines",null,null,null,null,null,null,null,0,""]
["Rail Structures",null,null,null,null,null,null,null,0,""]
["Rail Furniture",null,null,null,null,null,null,null,0,""]
["Drainage Collection",null,null,null,null,null,null,null,0,""]
["Storm water Conveyance",null,null,null,null,null,null,null,0,""]
["Attenuation",null,null,null,null,null,null,null,0,""]
["MV Substations",null,null,null,null,null,null,null,0,""]
["LV Networks",null,null,null,null,null,null,null,0,""]
["Capital Spares",null,null,null,null,null,null,null,0,""]
["Coastal Infrastructure",null,{"$f":"SUM(C64:C68)","v":0},0,0,0,0,0,0,"",{"$f":"SUM(K64:K68)","v":0}]
["Sand Pumps",null,null,null,null,null,null,null,0,""]
["Piers",null,null,null,null,null,null,null,0,""]
["Revetments",null,null,null,null,null,null,null,0,""]
["Promenades",null,null,null,null,null,null,null,0,""]
["Capital Spares",null,null,null,null,null,null,null,0,""]
["Information and Communication Infrastructure",null,{"$f":"SUM(C70:C73)","v":0},0,0,0,0,0,0,"",{"$f":"SUM(K70:K73)","v":0}]
["Data Centres",null,null,null,null,null,null,null,0,""]
["Core Layers",null,null,null,null,null,null,null,0,""]
["Distribution Layers",null,null,null,null,null,null,null,0,""]
["Capital Spares",null,null,null,null,null,null,null,0,""]
[null,null,null,null,null,null,null,null,null,""]
["Community Assets",null,{"$f":"+C76+C99","v":0},7721089,8704089,722663.63,5781308.9799999995,5343984,-437324.97999999952,-8.1835009236554512E-2,{"$f":"+K76+K99","v":8704089}]
["Community Facilities",null,{"$f":"SUM(C77:C98)","v":0},6780589,7483589,621206.51,4969652.01,4660984,-308668.00999999978,-6.6223786651059047E-2,{"$f":"SUM(K77:K98)","v":7483589}]
["Halls",null,0,3869217,4689217,390486.01,3123888.08,2743480,-380408.08000000007,-0.13865895869479641,4689217]
["Centres",null,null,null,null,null,null,null,0,""]
["Crèches",null,null,null,null,null,null,null,0,""]
["Clinics/Care Centres",null,0,240350,240350,18759.84,150078.65,160232,10153.350000000006,6.3366555993809012E-2,240350]
["Fire/Ambulance Stations",null,null,null,null,null,null,null,0,""]
["Testing Stations",null,0,361048,311048,25338.65,202709.2,230696,27986.799999999988,0.12131463050941493,311048]
["Museums",null,null,null,null,null,null,null,0,""]
["Galleries",null,null,null,null,null,null,null,0,""]
["Theatres",null,null,null,null,null,null,null,0,""]
["Libraries",null,0,862648,827648,68871.89,550975.12,568096,17120.880000000005,3.0137300737903463E-2,827648]
["Cemeteries/Crematoria",null,0,616550,591550,49160.77,393286.16,406032,12745.840000000026,3.1391220396422018E-2,591550]
["Police",null,null,null,null,null,null,null,0,""]
["Purls",null,null,null,null,null,null,null,0,""]
["Public Open Space",null,null,null,null,null,null,null,0,""]
["Nature Reserves",null,null,null,null,null,null,null,0,""]
["Public Ablution Facilities",null,null,null,null,null,null,null,0,""]
["Markets",null,0,82033,78033,6502.49,52019.92,53888,1868.0800000000017,3.4665973871734E-2,78033]
["Stalls",null,null,null,null,null,null,null,0,""]
["Abattoirs",null,null,null,null,null,null,null,0,""]
["Airports",null,null,null,null,null,null,null,0,""]
["Taxi Ranks/Bus Terminals",null,0,748743,745743,62086.86,496694.88,498560,1865.1199999999953,3.7410141206675133E-3,745743]
["Capital Spares",null,null,null,null,null,null,null,0,""]
["Sport and Recreation Facilities",null,{"$f":"SUM(C100:C102)","v":0},940500,1220500,101457.12,811656.97,683000,-128656.96999999997,-0.18837038067349923,{"$f":"SUM(K100:K102)","v":1220500}]
["Indoor Facilities",null,null,null,null,null,null,null,0,""]
["Outdoor Facilities",null,0,940500,1220500,101457.12,811656.97,683000,{"$f":"H101-G101","v":-128656.96999999997},{"$f":"IF(I101=0,\"\",I101/H101)","v":-0.18837038067349923},1220500]
["Capital Spares",null,null,null,null,null,null,null,0,""]
["Heritage assets",null,{"$f":"SUM(C104:C108)","v":0},0,0,0,0,0,0,"",{"$f":"SUM(K104:K108)","v":0}]
["Monuments",null,null,null,null,null,null,null,0,""]
["Historic Buildings",null,null,null,null,null,null,null,0,""]
["Works of Art",null,null,null,null,null,null,null,0,""]
["Conservation Areas",null,null,null,null,null,null,null,0,""]
["Other Heritage",null,null,null,null,null,null,null,0,""]
[null,null,null,null,null,null,null,null,0,""]
["Investment properties",null,{"$f":"+C111+C114","v":0},0,0,0,0,0,0,"",{"$f":"+K111+K114","v":0}]
["Revenue Generating",null,{"$f":"SUM(C112:C113)","v":0},0,0,0,0,0,0,"",{"$f":"SUM(K112:K113)","v":0}]
["Improved Property",null,0,0,0,0,0,0,0,"",0]
["Unimproved Property",null,0,0,0,0,0,0,0,"",0]
["Non-revenue Generating",null,{"$f":"SUM(C115:C116)","v":0},0,0,0,0,0,0,"",{"$f":"SUM(K115:K116)","v":0}]
["Improved Property",null,null,null,null,null,null,null,0,""]
["Unimproved Property",null,null,null,null,null,null,null,{"$f":"H116-G116","v":0},{"$f":"IF(I116=0,\"\",I116/H116)","v":""}]
["Other assets",null,{"$f":"+C118+C130","v":0},9243179,3093179,256863.51,2054908.08,4932120,2877211.92,0.58336210797790811,{"$f":"+K118+K130","v":3093179}]
["Operational Buildings",null,{"$f":"SUM(C119:C129)","v":0},9243179,3093179,256863.51,2054908.08,4932120,2877211.92,0.58336210797790811,{"$f":"SUM(K119:K129)","v":3093179}]
["Municipal Offices",null,0,9243179,3093179,256863.51,2054908.08,4932120,2877211.92,0.58336210797790811,3093179]
["Pay/Enquiry Points",null,null,null,null,null,null,null,0,""]
["Building Plan Offices",null,null,null,null,null,null,null,0,""]
["Workshops",null,null,null,null,null,null,null,0,""]
["Yards",null,null,null,null,null,null,null,0,""]
["Stores",null,null,null,null,null,null,null,0,""]
["Laboratories",null,null,null,null,null,null,null,0,""]
["Training Centres",null,null,null,null,null,null,null,0,""]
["Manufacturing Plant",null,null,null,null,null,null,null,0,""]
["Depots",null,null,null,null,null,null,null,0,""]
["Capital Spares",null,null,null,null,null,null,null,0,""]
["Housing",null,{"$f":"SUM(C131:C133)","v":0},0,0,0,0,0,0,"",{"$f":"SUM(K131:K133)","v":0}]
["Staff Housing",null,null,null,null,null,null,null,0,""]
["Social Housing",null,null,null,null,null,null,null,0,""]
["Capital Spares",null,null,null,null,null,null,null,0,""]
[null,null,null,null,null,null,null,null,null,""]
["Biological or Cultivated Assets",null,{"$f":"SUM(C136:C136)","v":0},0,0,0,0,0,{"$f":"H135-G135","v":0},"",{"$f":"SUM(K136)","v":0}]
["Biological or Cultivated Assets",null,null,null,null,null,null,null,{"$f":"H136-G136","v":0},""]
[null,null,null,null,null,null,null,null,null,{"$f":"IF(I137=0,\"\",I137/H137)","v":""}]
["Intangible Assets",null,{"$f":"SUM(C139:C140)","v":0},30194,150194,0,0,44128,{"$f":"H138-G138","v":44128},1,{"$f":"SUM(K139:K140)","v":150194}]
["Servitudes",null,null,null,null,null,null,null,0,""]
["Licences and Rights",null,{"$f":"SUM(C141:C146)","v":0},30194,150194,0,0,44128,44128,1,{"$f":"SUM(K141:K146)","v":150194}]
["Water Rights",null,null,null,null,null,null,null,0,""]
["Effluent Licenses",null,null,null,null,null,null,null,0,""]
["Solid Waste Licenses",null,null,null,null,null,null,null,0,""]
["Computer Software and Applications",null,0,30194,150194,0,0,44128,44128,1,150194]
["Load Settlement Software Applications",null,null,null,null,null,null,null,0,""]
["Unspecified",null,null,null,null,null,null,null,0,""]
[]
["Computer Equipment",null,{"$f":"SUM(C149:C149)","v":0},1641267,311267,25653.69,204248.29,828176,{"$f":"H148-G148","v":623927.71},{"$f":"IF(I148=0,\"\",I148/H148)","v":0.75337574380324945},{"$f":"SUM(K149)","v":311267}]
["Computer Equipment",null,0,1641267,311267,25653.69,204248.29,828176,{"$f":"H149-G149","v":623927.71},{"$f":"IF(I149=0,\"\",I149/H149)","v":0.75337574380324945},311267]
[]
["Furniture and Office Equipment",null,{"$f":"SUM(C152:C152)","v":13577.88},1216019,316019,24767.57,198140.57,630680,{"$f":"H151-G151","v":432539.43},{"$f":"IF(I151=0,\"\",I151/H151)","v":0.68583026257372992},{"$f":"SUM(K152)","v":316019}]
["Furniture and Office Equipment",null,13577.88,1216019,316019,24767.57,198140.57,630680,{"$f":"H152-G152","v":432539.43},{"$f":"IF(I152=0,\"\",I152/H152)","v":0.68583026257372992},316019]
[null,null,null,null,null,null,null,null,null,{"$f":"IF(I153=0,\"\",I153/H153)","v":""}]
["Machinery and Equipment",null,{"$f":"SUM(C155:C155)","v":0},2801139,101139,4848.88,37938.82,1327424,{"$f":"H154-G154","v":1289485.18},{"$f":"IF(I154=0,\"\",I154/H154)","v":0.97141921496070582},{"$f":"SUM(K155)","v":101139}]
["Machinery and Equipment",null,0,2801139,101139,4848.88,37938.82,1327424,{"$f":"H155-G155","v":1289485.18},{"$f":"IF(I155=0,\"\",I155/H155)","v":0.97141921496070582},101139]
[]
["Transport Assets",null,{"$f":"SUM(C158:C158)","v":0},2009447,3134447,260888.36,2087107.15,1564632,{"$f":"H157-G157","v":-522475.14999999991},{"$f":"IF(I157=0,\"\",I157/H157)","v":-0.33392845729858517},{"$f":"SUM(K158)","v":3134447}]
["Transport Assets",null,0,2009447,3134447,260888.36,2087107.15,1564632,{"$f":"H158-G158","v":-522475.14999999991},{"$f":"IF(I158=0,\"\",I158/H158)","v":-0.33392845729858517},3134447]
[]
["Land",null,{"$f":"SUM(C161:C161)","v":0},0,0,0,0,0,{"$f":"H160-G160","v":0},{"$f":"IF(I160=0,\"\",I160/H160)","v":""},{"$f":"SUM(K161)","v":0}]
["Land",null,null,null,null,null,null,null,{"$f":"H161-G161","v":0},{"$f":"IF(I161=0,\"\",I161/H161)","v":""}]
[]
["Zoo's, Marine and Non-biological Animals",null,{"$f":"SUM(C164:C164)","v":0},0,0,0,0,0,{"$f":"H163-G163","v":0},{"$f":"IF(I163=0,\"\",I163/H163)","v":""},{"$f":"SUM(K164)","v":0}]
["Zoo's, Marine and Non-biological Animals",null,null,null,null,null,null,null,{"$f":"H164-G164","v":0},{"$f":"IF(I164=0,\"\",I164/H164)","v":""}]
[null,null,null,null,null,null,null,null,null,{"$f":"IF(I165=0,\"\",I165/H165)","v":""}]
["Total Depreciation",1,{"$f":"C7+C75+C103+C110+C117+C135+C138+C148+C151+C154+C157+C160+C163","v":13577.88},32261244,32261244,2447456.9199999995,19577822.149999999,21507488,1929665.8500000015,8.9720652174721735E-2,{"$f":"K7+K75+K103+K110+K117+K135+K138+K148+K151+K154+K157+K160+K163","v":32261244}]

{"sheet":"SC13e","index":33,"n_rows":171,"n_cols":11,"rows_kept":171,"cut":false,"hidden":false,"merged":[[0,0,0,10],[1,0,2,0],[1,1,2,1]]}
[{"$f":"muni& \" - \"&S71Se& \" - \"&Head57","v":"LIM355 Lepelle-Nkumpi - Supporting Table SC13e Monthly Budget Statement - capital expenditure on upgrading of existing assets by asset class - M08 February"}]
[{"$f":"desc","v":"Description"},{"$f":"head27","v":"Ref"},{"$f":"Head1","v":"2019/20"},{"$f":"Head2","v":"Budget Year 2020/21"}]
[null,null,{"$f":"Head5","v":"Audited Outcome"},{"$f":"Head6","v":"Original Budget"},{"$f":"Head7","v":"Adjusted Budget"},{"$f":"Head38","v":"Monthly actual"},{"$f":"Head39","v":"YearTD actual"},{"$f":"Head40","v":"YearTD budget"},{"$f":"Head41","v":"YTD variance"},{"$f":"Head41","v":"YTD variance"},{"$f":"Head8","v":"Full Year Forecast"}]
["R thousands",1,null,null,null,null,null,null,null,"%"]
["Capital expenditure on upgrading of existing assets by Asset Class/Sub-class"]
[]
["Infrastructure",null,{"$f":"C8+C13+C17+C27+C38+C45+C53+C63+C69","v":720.11},0,7400000,2785248.19,2785248.19,1480000,{"$f":"H7-G7","v":-1305248.19},{"$f":"IF(I7=0,\"\",I7/H7)","v":-0.8819244527027027},{"$f":"K8+K13+K17+K27+K38+K45+K53+K63+K69","v":7400000}]
["Roads Infrastructure",null,{"$f":"SUM(C9:C12)","v":0},0,7400000,2785248.19,2785248.19,1480000,-1305248.19,-0.8819244527027027,{"$f":"SUM(K9:K12)","v":7400000}]
["Roads",null,0,0,7400000,2785248.19,2785248.19,1480000,-1305248.19,-0.8819244527027027,7400000]
["Road Structures",null,0,0,0,0,0,0,0,"",0]
["Road Furniture",null,null,null,null,null,null,null,0,""]
["Capital Spares",null,null,null,null,null,null,null,0,""]
["Storm water Infrastructure",null,{"$f":"SUM(C14:C16)","v":720.11},0,0,0,0,0,0,"",{"$f":"SUM(K14:K16)","v":0}]
["Drainage Collection",null,null,null,null,null,null,null,0,""]
["Storm water Conveyance",null,720.11,0,0,0,0,0,0,"",0]
["Attenuation",null,null,null,null,null,null,null,0,""]
["Electrical Infrastructure",null,{"$f":"SUM(C18:C26)","v":0},0,0,0,0,0,0,"",{"$f":"SUM(K18:K26)","v":0}]
["Power Plants",null,null,null,null,null,null,null,0,""]
["HV Substations",null,null,null,null,null,null,null,0,""]
["HV Switching Station",null,null,null,null,null,null,null,0,""]
["HV Transmission Conductors",null,null,null,null,null,null,null,0,""]
["MV Substations",null,null,null,null,null,null,null,0,""]
["MV Switching Stations",null,null,null,null,null,null,null,0,""]
["MV Networks",null,0,0,0,0,0,0,0,"",0]
["LV Networks",null,null,null,null,null,null,null,0,""]
["Capital Spares",null,null,null,null,null,null,null,0,""]
["Water Supply Infrastructure",null,{"$f":"SUM(C28:C37)","v":0},0,0,0,0,0,0,"",{"$f":"SUM(K28:K37)","v":0}]
["Dams and Weirs",null,null,null,null,null,null,null,0,""]
["Boreholes",null,null,null,null,null,null,null,0,""]
["Reservoirs",null,null,null,null,null,null,null,0,""]
["Pump Stations",null,null,null,null,null,null,null,0,""]
["Water Treatment Works",null,null,null,null,null,null,null,0,""]
["Bulk Mains",null,null,null,null,null,null,null,0,""]
["Distribution",null,null,null,null,null,null,null,0,""]
["Distribution Points",null,null,null,null,null,null,null,0,""]
["PRV Stations",null,null,null,null,null,null,null,0,""]
["Capital Spares",null,null,null,null,null,null,null,0,""]
["Sanitation Infrastructure",null,{"$f":"SUM(C39:C44)","v":0},0,0,0,0,0,0,"",{"$f":"SUM(K39:K44)","v":0}]
["Pump Station",null,null,null,null,null,null,null,0,""]
["Reticulation",null,null,null,null,null,null,null,0,""]
["Waste Water Treatment Works",null,null,null,null,null,null,null,0,""]
["Outfall Sewers",null,null,null,null,null,null,null,0,""]
["Toilet Facilities",null,null,null,null,null,null,null,0,""]
["Capital Spares",null,null,null,null,null,null,null,0,""]
["Solid Waste Infrastructure",null,{"$f":"SUM(C46:C52)","v":0},0,0,0,0,0,0,"",{"$f":"SUM(K46:K52)","v":0}]
["Landfill Sites",null,null,null,null,null,null,null,0,""]
["Waste Transfer Stations",null,null,null,null,null,null,null,0,""]
["Waste Processing Facilities",null,null,null,null,null,null,null,0,""]
["Waste Drop-off Points",null,null,null,null,null,null,null,0,""]
["Waste Separation Facilities",null,null,null,null,null,null,null,0,""]
["Electricity Generation Facilities",null,null,null,null,null,null,null,0,""]
["Capital Spares",null,null,null,null,null,null,null,0,""]
["Rail Infrastructure",null,{"$f":"SUM(C54:C62)","v":0},0,0,0,0,0,0,"",{"$f":"SUM(K54:K62)","v":0}]
["Rail Lines",null,null,null,null,null,null,null,0,""]
["Rail Structures",null,null,null,null,null,null,null,0,""]
["Rail Furniture",null,null,null,null,null,null,null,0,""]
["Drainage Collection",null,null,null,null,null,null,null,0,""]
["Storm water Conveyance",null,null,null,null,null,null,null,0,""]
["Attenuation",null,null,null,null,null,null,null,0,""]
["MV Substations",null,null,null,null,null,null,null,0,""]
["LV Networks",null,null,null,null,null,null,null,0,""]
["Capital Spares",null,null,null,null,null,null,null,0,""]
["Coastal Infrastructure",null,{"$f":"SUM(C64:C68)","v":0},0,0,0,0,0,0,"",{"$f":"SUM(K64:K68)","v":0}]
["Sand Pumps",null,null,null,null,null,null,null,0,""]
["Piers",null,null,null,null,null,null,null,0,""]
["Revetments",null,null,null,null,null,null,null,0,""]
["Promenades",null,null,null,null,null,null,null,0,""]
["Capital Spares",null,null,null,null,null,null,null,0,""]
["Information and Communication Infrastructure",null,{"$f":"SUM(C70:C73)","v":0},0,0,0,0,0,0,"",{"$f":"SUM(K70:K73)","v":0}]
["Data Centres",null,null,null,null,null,null,null,0,""]
["Core Layers",null,null,null,null,null,null,null,0,""]
["Distribution Layers",null,null,null,null,null,null,null,0,""]
["Capital Spares",null,null,null,null,null,null,null,0,""]
[null,null,null,null,null,null,null,null,null,""]
["Community Assets",null,{"$f":"+C76+C99","v":0},0,0,0,0,0,0,"",{"$f":"+K76+K99","v":0}]
["Community Facilities",null,{"$f":"SUM(C77:C98)","v":0},0,0,0,0,0,0,"",{"$f":"SUM(K77:K98)","v":0}]
["Halls",null,null,null,null,null,null,null,0,""]
["Centres",null,null,null,null,null,null,null,0,""]
["Crèches",null,null,null,null,null,null,null,0,""]
["Clinics/Care Centres",null,null,null,null,null,null,null,0,""]
["Fire/Ambulance Stations",null,null,null,null,null,null,null,0,""]
["Testing Stations",null,null,null,null,null,null,null,0,""]
["Museums",null,null,null,null,null,null,null,0,""]
["Galleries",null,null,null,null,null,null,null,0,""]
["Theatres",null,null,null,null,null,null,null,0,""]
["Libraries",null,null,null,null,null,null,null,0,""]
["Cemeteries/Crematoria",null,null,null,null,null,null,null,0,""]
["Police",null,null,null,null,null,null,null,0,""]
["Purls",null,0,0,0,0,0,0,0,"",0]
["Public Open Space",null,null,null,null,null,null,null,0,""]
["Nature Reserves",null,null,null,null,null,null,null,0,""]
["Public Ablution Facilities",null,null,null,null,null,null,null,0,""]
["Markets",null,null,null,null,null,null,null,0,""]
["Stalls",null,null,null,null,null,null,null,0,""]
["Abattoirs",null,null,null,null,null,null,null,0,""]
["Airports",null,null,null,null,null,null,null,0,""]
["Taxi Ranks/Bus Terminals",null,null,null,null,null,null,null,0,""]
["Capital Spares",null,null,null,null,null,null,null,0,""]
["Sport and Recreation Facilities",null,{"$f":"SUM(C100:C102)","v":0},0,0,0,0,0,0,"",{"$f":"SUM(K100:K102)","v":0}]
["Indoor Facilities",null,null,null,null,null,null,null,0,""]
["Outdoor Facilities",null,0,0,0,0,0,0,{"$f":"H101-G101","v":0},{"$f":"IF(I101=0,\"\",I101/H101)","v":""},0]
["Capital Spares",null,null,null,null,null,null,null,0,""]
["Heritage assets",null,{"$f":"SUM(C104:C108)","v":0},0,0,0,0,0,0,"",{"$f":"SUM(K104:K108)","v":0}]
["Monuments",null,null,null,null,null,null,null,0,""]
["Historic Buildings",null,null,null,null,null,null,null,0,""]
["Works of Art",null,null,null,null,null,null,null,0,""]
["Conservation Areas",null,null,null,null,null,null,null,0,""]
["Other Heritage",null,null,null,null,null,null,null,0,""]
[null,null,null,null,null,null,null,null,0,""]
["Investment properties",null,{"$f":"+C111+C114","v":0},0,0,0,0,0,0,"",{"$f":"+K111+K114","v":0}]
["Revenue Generating",null,{"$f":"SUM(C112:C113)","v":0},0,0,0,0,0,0,"",{"$f":"SUM(K112:K113)","v":0}]
["Improved Property",null,null,null,null,null,null,null,0,""]
["Unimproved Property",null,null,null,null,null,null,null,0,""]
["Non-revenue Generating",null,{"$f":"SUM(C115:C116)","v":0},0,0,0,0,0,0,"",{"$f":"SUM(K115:K116)","v":0}]
["Improved Property",null,null,null,null,null,null,null,0,""]
["Unimproved Property",null,null,null,null,null,null,null,{"$f":"H116-G116","v":0},{"$f":"IF(I116=0,\"\",I116/H116)","v":""}]
["Other assets",null,{"$f":"+C118+C130","v":0},9600000,9600000,0,0,6400000,6400000,1,{"$f":"+K118+K130","v":9600000}]
["Operational Buildings",null,{"$f":"SUM(C119:C129)","v":0},9600000,9600000,0,0,6400000,6400000,1,{"$f":"SUM(K119:K129)","v":9600000}]
["Municipal Offices",null,0,9600000,9600000,0,0,6400000,6400000,1,9600000]
["Pay/Enquiry Points",null,null,null,null,null,null,null,0,""]
["Building Plan Offices",null,null,null,null,null,null,null,0,""]
["Workshops",null,null,null,null,null,null,null,0,""]
["Yards",null,null,null,null,null,null,null,0,""]
["Stores",null,null,null,null,null,null,null,0,""]
["Laboratories",null,null,null,null,null,null,null,0,""]
["Training Centres",null,null,null,null,null,null,null,0,""]
["Manufacturing Plant",null,null,null,null,null,null,null,0,""]
["Depots",null,null,null,null,null,null,null,0,""]
["Capital Spares",null,null,null,null,null,null,null,0,""]
["Housing",null,{"$f":"SUM(C131:C133)","v":0},0,0,0,0,0,0,"",{"$f":"SUM(K131:K133)","v":0}]
["Staff Housing",null,null,null,null,null,null,null,0,""]
["Social Housing",null,null,null,null,null,null,null,0,""]
["Capital Spares",null,null,null,null,null,null,null,0,""]
[null,null,null,null,null,null,null,null,null,""]
["Biological or Cultivated Assets",null,{"$f":"SUM(C136:C136)","v":0},0,0,0,0,0,{"$f":"H135-G135","v":0},"",{"$f":"SUM(K136)","v":0}]
["Biological or Cultivated Assets",null,null,null,null,null,null,null,{"$f":"H136-G136","v":0},""]
[null,null,null,null,null,null,null,null,null,{"$f":"IF(I137=0,\"\",I137/H137)","v":""}]
["Intangible Assets",null,{"$f":"SUM(C139:C140)","v":0},0,0,0,0,0,{"$f":"H138-G138","v":0},"",{"$f":"SUM(K139:K140)","v":0}]
["Servitudes",null,null,null,null,null,null,null,0,""]
["Licences and Rights",null,{"$f":"SUM(C141:C146)","v":0},0,0,0,0,0,0,"",{"$f":"SUM(K141:K146)","v":0}]
["Water Rights",null,null,null,null,null,null,null,0,""]
["Effluent Licenses",null,null,null,null,null,null,null,0,""]
["Solid Waste Licenses",null,null,null,null,null,null,null,0,""]
["Computer Software and Applications",null,null,null,null,null,null,null,0,""]
["Load Settlement Software Applications",null,null,null,null,null,null,null,0,""]
["Unspecified",null,null,null,null,null,null,null,0,""]
[]
["Computer Equipment",null,{"$f":"SUM(C149:C149)","v":0},0,0,0,0,0,{"$f":"H148-G148","v":0},{"$f":"IF(I148=0,\"\",I148/H148)","v":""},{"$f":"SUM(K149)","v":0}]
["Computer Equipment",null,null,null,null,null,null,null,{"$f":"H149-G149","v":0},{"$f":"IF(I149=0,\"\",I149/H149)","v":""}]
[]
["Furniture and Office Equipment",null,{"$f":"SUM(C152:C152)","v":0},0,0,0,0,0,{"$f":"H151-G151","v":0},{"$f":"IF(I151=0,\"\",I151/H151)","v":""},{"$f":"SUM(K152)","v":0}]
["Furniture and Office Equipment",null,null,null,null,null,null,null,{"$f":"H152-G152","v":0},{"$f":"IF(I152=0,\"\",I152/H152)","v":""}]
[null,null,null,null,null,null,null,null,null,{"$f":"IF(I153=0,\"\",I153/H153)","v":""}]
["Machinery and Equipment",null,{"$f":"SUM(C155:C155)","v":0},0,0,0,0,0,{"$f":"H154-G154","v":0},{"$f":"IF(I154=0,\"\",I154/H154)","v":""},{"$f":"SUM(K155)","v":0}]
["Machinery and Equipment",null,null,null,null,null,null,null,{"$f":"H155-G155","v":0},{"$f":"IF(I155=0,\"\",I155/H155)","v":""}]
[]
["Transport Assets",null,{"$f":"SUM(C158:C158)","v":0},0,0,0,0,0,{"$f":"H157-G157","v":0},{"$f":"IF(I157=0,\"\",I157/H157)","v":""},{"$f":"SUM(K158)","v":0}]
["Transport Assets",null,null,null,null,null,null,null,{"$f":"H158-G158","v":0},{"$f":"IF(I158=0,\"\",I158/H158)","v":""}]
[]
["Land",null,{"$f":"SUM(C161:C161)","v":0},0,0,0,0,0,{"$f":"H160-G160","v":0},{"$f":"IF(I160=0,\"\",I160/H160)","v":""},{"$f":"SUM(K161)","v":0}]
["Land",null,null,null,null,null,null,null,{"$f":"H161-G161","v":0},{"$f":"IF(I161=0,\"\",I161/H161)","v":""}]
[null,null,null,null,null,null,null,null,null,"."]
["Zoo's, Marine and Non-biological Animals",null,{"$f":"SUM(C164:C164)","v":0},0,0,0,0,0,{"$f":"H163-G163","v":0},{"$f":"IF(I163=0,\"\",I163/H163)","v":""},{"$f":"SUM(K164)","v":0}]
["Zoo's, Marine and Non-biological Animals",null,null,null,null,null,null,null,{"$f":"H164-G164","v":0},{"$f":"IF(I164=0,\"\",I164/H164)","v":""}]
[null,null,null,null,null,null,null,null,null,{"$f":"IF(I165=0,\"\",I165/H165)","v":""}]
["Total Capital Expenditure on upgrading of existing assets ",1,{"$f":"C7+C75+C103+C110+C117+C135+C138+C148+C151+C154+C157+C160+C163","v":720.11},9600000,17000000,2785248.19,2785248.19,7880000,{"$f":"H166-G166","v":5094751.8100000005},{"$f":"IF(I166=0,\"\",I166/H166)","v":0.64654210786802035},{"$f":"K7+K75+K103+K110+K117+K135+K138+K148+K151+K154+K157+K160+K163","v":17000000}]
[]
[{"$f":"head27a","v":"References"}]
["1. Total Capital Expenditure on new assets (SC13a) plus Total Capital Expenditure on renewal of existing assets (SC13b) plus Total Capital Expenditure on upgrading of existing assets (SC13e)  must reconcile to total capital expenditure in Table C5"]
[]
["check balance",null,{"$f":"C166+SC13a!C166+SC13b!C166-'C5-Capex'!C40","v":0},{"$f":"D166+SC13a!D166+SC13b!D166-'C5-Capex'!D40","v":0},{"$f":"E166+SC13a!E166+SC13b!E166-'C5-Capex'!E40","v":0},{"$f":"F166+SC13a!F166+SC13b!F166-'C5-Capex'!F40","v":0},{"$f":"G166+SC13a!G166+SC13b!G166-'C5-Capex'!G40","v":0},{"$f":"H166+SC13a!H166+SC13b!H166-'C5-Capex'!H40","v":0},null,null,{"$f":"K166+SC13a!K166+SC13b!K166-'C5-Capex'!K40","v":0}]

{"sheet":"SC71charts","index":34,"n_rows":104,"n_cols":10,"rows_kept":104,"cut":false,"hidden":false,"merged":[]}
[{"$f":"'Template names'!B102","v":"Chart C1 2020/21 Capital Expenditure Monthly Trend: actual v target"}]
["Month",{"$f":"'SC12'!B2","v":"2019/20"},{"$f":"'SC12'!C3","v":"Original Budget"},{"$f":"'SC12'!D3","v":"Adjusted Budget"},{"$f":"'SC12'!E3","v":"Monthly actual"}]
[{"$f":"LEFT('SC12'!A6,3)","v":"Jul"},{"$f":"'SC12'!B6","v":0},{"$f":"'SC12'!C6","v":11222354.189999999},{"$f":"'SC12'!D6","v":11222357},{"$f":"'SC12'!E6","v":0}]
[{"$f":"LEFT('SC12'!A7,3)","v":"Aug"},{"$f":"'SC12'!B7","v":0},{"$f":"'SC12'!C7","v":11222354.189999999},{"$f":"'SC12'!D7","v":11222357},{"$f":"'SC12'!E7","v":2762389.24}]
[{"$f":"LEFT('SC12'!A8,3)","v":"Sep"},{"$f":"'SC12'!B8","v":0},{"$f":"'SC12'!C8","v":11222354.189999999},{"$f":"'SC12'!D8","v":13874357},{"$f":"'SC12'!E8","v":3884812.03}]
[{"$f":"LEFT('SC12'!A9,3)","v":"Oct"},{"$f":"'SC12'!B9","v":0},{"$f":"'SC12'!C9","v":11222354.189999999},{"$f":"'SC12'!D9","v":13874357},{"$f":"'SC12'!E9","v":529086.29}]
[{"$f":"LEFT('SC12'!A10,3)","v":"Nov"},{"$f":"'SC12'!B10","v":0},{"$f":"'SC12'!C10","v":11222354.189999999},{"$f":"'SC12'!D10","v":13874357},{"$f":"'SC12'!E10","v":8750004.2100000009}]
[{"$f":"LEFT('SC12'!A11,3)","v":"Dec"},{"$f":"'SC12'!B11","v":0},{"$f":"'SC12'!C11","v":11222354.189999999},{"$f":"'SC12'!D11","v":13874357},{"$f":"'SC12'!E11","v":4221519.49}]
[{"$f":"LEFT('SC12'!A12,3)","v":"Jan"},{"$f":"'SC12'!B12","v":0},{"$f":"'SC12'!C12","v":11222354.189999999},{"$f":"'SC12'!D12","v":13874357},{"$f":"'SC12'!E12","v":511017.16}]
[{"$f":"LEFT('SC12'!A13,3)","v":"Feb"},{"$f":"'SC12'!B13","v":0},{"$f":"'SC12'!C13","v":11222354.189999999},{"$f":"'SC12'!D13","v":14540665},{"$f":"'SC12'!E13","v":1777210.5}]
[{"$f":"LEFT('SC12'!A14,3)","v":"Mar"},{"$f":"'SC12'!B14","v":0},{"$f":"'SC12'!C14","v":11222354.189999999},{"$f":"'SC12'!D14","v":14540665},{"$f":"'SC12'!E14","v":0}]
[{"$f":"LEFT('SC12'!A15,3)","v":"Apr"},{"$f":"'SC12'!B15","v":0},{"$f":"'SC12'!C15","v":11222354.189999999},{"$f":"'SC12'!D15","v":14540665},{"$f":"'SC12'!E15","v":0}]
[{"$f":"LEFT('SC12'!A16,3)","v":"May"},{"$f":"'SC12'!B16","v":0},{"$f":"'SC12'!C16","v":11222354.189999999},{"$f":"'SC12'!D16","v":14540665},{"$f":"'SC12'!E16","v":0}]
[{"$f":"LEFT('SC12'!A17,3)","v":"Jun"},{"$f":"'SC12'!B17","v":0},{"$f":"'SC12'!C17","v":11222353.91},{"$f":"'SC12'!D17","v":14540631},{"$f":"'SC12'!E17","v":0}]
[]
[]
[]
[]
[]
[]
[]
[]
[]
[]
[]
[{"$f":"'Template names'!B103","v":"Chart C2 2020/21 Capital Expenditure: YTD actual v YTD target"}]
["Month",{"$f":"'SC12'!F3","v":"YearTD actual"},{"$f":"'SC12'!G3","v":"YearTD budget"}]
[{"$f":"LEFT('SC12'!A6,3)","v":"Jul"},{"$f":"'SC12'!F6","v":""},{"$f":"'SC12'!G6","v":11222357}]
[{"$f":"LEFT('SC12'!A7,3)","v":"Aug"},{"$f":"'SC12'!F7","v":{"$error":"#VALUE!"}},{"$f":"'SC12'!G7","v":22444714}]
[{"$f":"LEFT('SC12'!A8,3)","v":"Sep"},{"$f":"'SC12'!F8","v":{"$error":"#VALUE!"}},{"$f":"'SC12'!G8","v":36319071}]
[{"$f":"LEFT('SC12'!A9,3)","v":"Oct"},{"$f":"'SC12'!F9","v":{"$error":"#VALUE!"}},{"$f":"'SC12'!G9","v":50193428}]
[{"$f":"LEFT('SC12'!A10,3)","v":"Nov"},{"$f":"'SC12'!F10","v":{"$error":"#VALUE!"}},{"$f":"'SC12'!G10","v":64067785}]
[{"$f":"LEFT('SC12'!A11,3)","v":"Dec"},{"$f":"'SC12'!F11","v":{"$error":"#VALUE!"}},{"$f":"'SC12'!G11","v":77942142}]
[{"$f":"LEFT('SC12'!A12,3)","v":"Jan"},{"$f":"'SC12'!F12","v":{"$error":"#VALUE!"}},{"$f":"'SC12'!G12","v":91816499}]
[{"$f":"LEFT('SC12'!A13,3)","v":"Feb"},{"$f":"'SC12'!F13","v":{"$error":"#VALUE!"}},{"$f":"'SC12'!G13","v":106357164}]
[{"$f":"LEFT('SC12'!A14,3)","v":"Mar"},{"$f":"'SC12'!F14","v":""},{"$f":"'SC12'!G14","v":120897829}]
[{"$f":"LEFT('SC12'!A15,3)","v":"Apr"},{"$f":"'SC12'!F15","v":""},{"$f":"'SC12'!G15","v":135438494}]
[{"$f":"LEFT('SC12'!A16,3)","v":"May"},{"$f":"'SC12'!F16","v":""},{"$f":"'SC12'!G16","v":149979159}]
[{"$f":"LEFT('SC12'!A17,3)","v":"Jun"},{"$f":"'SC12'!F17","v":""},{"$f":"'SC12'!G17","v":164519790}]
[]
[]
[]
[]
[]
[]
[]
[]
[]
[]
[]
[{"$f":"'Template names'!B104","v":"Chart C3 Aged Consumer Debtors Analysis"}]
[null,{"$f":"'SC3'!C3","v":"0-30 Days"},{"$f":"'SC3'!D3","v":"31-60 Days"},{"$f":"'SC3'!E3","v":"61-90 Days"},{"$f":"'SC3'!F3","v":"91-120 Days"},{"$f":"'SC3'!G3","v":"121-150 Dys"},{"$f":"'SC3'!H3","v":"151-180 Dys"},{"$f":"'SC3'!I3","v":"181 Dys-1 Yr"},{"$f":"'SC3'!J3","v":"Over 1Yr"}]
[{"$f":"Head2","v":"Budget Year 2020/21"},{"$f":"'SC3'!C14","v":0},{"$f":"'SC3'!D14","v":0},{"$f":"'SC3'!E14","v":0},{"$f":"'SC3'!F14","v":0},{"$f":"'SC3'!G14","v":0},{"$f":"'SC3'!H14","v":0},{"$f":"'SC3'!I14","v":0},{"$f":"'SC3'!J14","v":0}]
[{"$f":"Head1","v":"2019/20"},{"$f":"'SC3'!C15","v":0},{"$f":"'SC3'!D15","v":0},{"$f":"'SC3'!E15","v":0},{"$f":"'SC3'!F15","v":0},{"$f":"'SC3'!G15","v":0},{"$f":"'SC3'!H15","v":0},{"$f":"'SC3'!I15","v":0},{"$f":"'SC3'!J15","v":0}]
[]
[]
[]
[]
[]
[]
[]
[]
[]
[]
[]
[]
[]
[]
[]
[]
[]
[]
[]
[]
[]
[{"$f":"'Template names'!B105","v":"Chart C4 Consumer Debtors (total by Debtor Customer Category)"}]
[null,{"$f":"Head1","v":"2019/20"},{"$f":"Head2","v":"Budget Year 2020/21"}]
[{"$f":"'SC3'!A17","v":"Organs of State"},{"$f":"C78*0.97","v":0},{"$f":"'SC3'!K17","v":0}]
[{"$f":"'SC3'!A18","v":"Commercial"},{"$f":"C79*0.97","v":0},{"$f":"'SC3'!K18","v":0}]
[{"$f":"'SC3'!A19","v":"Households"},{"$f":"C80*0.97","v":0},{"$f":"'SC3'!K19","v":0}]
[{"$f":"'SC3'!A20","v":"Other"},{"$f":"C81*0.97","v":0},{"$f":"'SC3'!K20","v":0}]
[]
[]
[]
[]
[]
[]
[]
[]
[]
[]
[]
[]
[]
[]
[]
[]
[]
[]
[]
[{"$f":"'Template names'!B106","v":"Chart C5 Aged Creditors Analysis"}]
[null,{"$f":"'SC4'!A6","v":"Bulk Electricity"},{"$f":"'SC4'!A7","v":"Bulk Water"},{"$f":"'SC4'!A8","v":"PAYE deductions"},{"$f":"'SC4'!A9","v":"VAT (output less input)"},{"$f":"'SC4'!A10","v":"Pensions / Retirement deductions"},{"$f":"'SC4'!A11","v":"Loan repayments"},{"$f":"'SC4'!A12","v":"Trade Creditors"},{"$f":"'SC4'!A13","v":"Auditor General"},{"$f":"'SC4'!A14","v":"Other"}]
[{"$f":"A54","v":"2019/20"},{"$f":"'SC4'!L6","v":0},{"$f":"'SC4'!L7","v":0},{"$f":"'SC4'!L8","v":0},{"$f":"'SC4'!L9","v":0},{"$f":"'SC4'!L10","v":0},{"$f":"'SC4'!L11","v":0},{"$f":"'SC4'!L12","v":0},{"$f":"'SC4'!L13","v":0},{"$f":"'SC4'!L14","v":0}]
[{"$f":"A53","v":"Budget Year 2020/21"},{"$f":"'SC4'!K6","v":0},{"$f":"'SC4'!K7","v":0},{"$f":"'SC4'!K8","v":0},{"$f":"'SC4'!K9","v":0},{"$f":"'SC4'!K10","v":0},{"$f":"'SC4'!K11","v":0},{"$f":"'SC4'!K12","v":0},{"$f":"'SC4'!K13","v":0},{"$f":"'SC4'!K14","v":0}]